{"text_format":"1","workbook":"xlsx","n_sheets":19,"sheets":["Customer Input","Pivot Tables","Input Calculation","Customer Information","Product Information","Order History","Create Customer Claim","Existing Customer Claim","3056223185","4438641204","5168832323","6315790090","6530353532","7139892245","8174368834","8785546312","9153230352","9184329830","9224318825"],"not_rendered":{"charts":0,"images":0,"macros":1,"external_links":0,"defined_names":0,"comments":0,"pivot_tables":4},"unopened":[],"bounds":{"document_bytes":16777216,"sheet_cells":100000,"rows_first":2000,"rows_last":500,"rows_between":2000,"halvings":0,"cell_chars":16384,"cell_head_chars":4096},"cells_cut":0,"cells_raw":0,"read":"whole","date_system":"1900"}

{"sheet":"Customer Input","index":0,"n_rows":29,"n_cols":19,"rows_kept":29,"cut":false,"hidden":false,"merged":[]}
["Date","First Name","Last Name","Phone","Email","Address","City","State","Zip","Item 1","Item 2","Item 3","Item 4","Item 5","Item 6","Item 7","Item 8","Item 9","Item 10"]
["2021-10-24","Matthew","Caputo",6315790090,"mattcap62480@gmail.com","7123 Montclair Peak Lane","Richmond","TX",77469,7250412,5216388,9242514]
["2021-10-24","John","Doe",8174368834,"noone@yahoo.com","1000 Main Street","Los Angeles","CA",98845,2056772,3055845]
["2021-10-24","Suzie","Kaploozie",7139892245,"sk2002@hotmail.com","3 Pine Road","Albany","NY",12313,3055845]
["2021-10-25","Mary","Jane",9184329830,"high@gmail.com","420 Weed Way","Denver","CO",88325,8924251,7250412,5216388]
["2021-10-25","William","Wont",5168832323,"NotHere@yahoo.com","823 1st St","Kansas City","MO",65923,9242514,3055845,7250412]
["2021-10-25","Peter","Pumpkineater",6530353532,"Orange@mail.com","32 Maple Road","Bloomington","VT",8876,8924251,7250412,8924251]
["2021-10-25","Jack","O'Lantern",8785546312,"halloween@hotmail.com","666 Evil Road","Hell","MO",10232,3055845]
["2021-10-26","Mary","Jane",9184329830,"high@gmail.com","420 Weed Way","Denver","CO",88325,8924251,2056772]
["2021-10-26","Suzie","Kaploozie",7139892245,"sk2002@hotmail.com","3 Pine Road","Albany","NY",12313,2056772]
["2021-10-26","Peter","Pumpkineater",6530353532,"Orange@mail.com","32 Maple Road","Bloomington","VT",8876,3055845,2056772,5216388]
["2021-10-27","Marie","Calendar",4438641204,"pies4life@gmail.com","3343 Rhubarb Road","Jacksonville","MI",30243,5216388,7250412,9242514]
["2021-10-27","Suzie","Kaploozie",7139892245,"sk2002@hotmail.com","3 Pine Road","Albany","NY",12313,3055845,8924251]
["2021-10-27","William","Wont",5168832323,"NotHere@yahoo.com","823 1st St","Kansas City","MO",65923,8924251,4989600,5086187,5216388,6671819,6738313,6808398,6832283,7250412]
["2021-10-27","John","Doe",8174368834,"noone@yahoo.com","1000 Main Street","Los Angeles","CA",98845,7250412]
["2021-10-27","Matthew","Caputo",6315790090,"mattcap62480@gmail.com","7123 Montclair Peak Lane","Richmond","TX",77469,5216388]
["2021-10-28","DJ","Rhythm",3056223185,"Tunes@yahoo.com","5544 Charles Road","Miami","FL",33465,4989600,3055845]
["2021-10-28","Mary","Jane",9184329830,"high@gmail.com","420 Weed Way","Denver","CO",88325,3055845]
["2021-10-28","Jack","O'Lantern",8785546312,"halloween@hotmail.com","666 Evil Road","Hell","MO",10232,3055845]
["2021-10-28","Charles","N'Charge",9224318825,"boss@hotmail.com","18765 Village Street","Seattle","WA",98923,8924251,5216388]
["2021-10-29","Matthew","Caputo",6315790090,"mattcap62480@gmail.com","7123 Montclair Peak Lane","Richmond","TX",77469,8924251,5216388]
["2021-10-29","John","Doe",8174368834,"noone@yahoo.com","1000 Main Street","Los Angeles","CA",98845,5216388]
["2021-10-29","Peter","Pumpkineater",6530353532,"Orange@mail.com","32 Maple Road","Bloomington","VT",8876,8924251]
["2021-10-29","Matthew","Caputo",6315790090,"mattcap62480@gmail.com","7123 Montclair Peak Lane","Richmond","TX",77469,7250412,8924251]
["2021-10-30","Mister","Liberace",9153230352,"Piano12@yahoo.com","432 Flamingo Drive","Las Vegas","NV",73547,1252953,1465559,1983220,2056772,2847693,3055845,3148653,3785616,3818725,3832255]
["2021-10-30","Suzie","Kaploozie",7139892245,"sk2002@hotmail.com","3 Pine Road","Albany","NY",12313,9242514,5216388]
["2021-10-30","Jack","O'Lantern",8785546312,"halloween@hotmail.com","666 Evil Road","Hell","MO",10232,3055845]
["2021-10-30","William","Wont",5168832323,"NotHere@yahoo.com","823 1st St","Kansas City","MO",65923,2056772,3055845]
["2021-10-30","Mary","Jane",9184329830,"high@gmail.com","420 Weed Way","Denver","CO",88325,2056772]

{"sheet":"Pivot Tables","index":1,"n_rows":62,"n_cols":5,"rows_kept":62,"cut":false,"hidden":false,"merged":[]}
[]
[]
["Row Labels","Sum of Number of Items","Sum of Grand Total"]
["Calendar Marie",3,601.74]
["Caputo Matthew",8,852.89999999999986]
["Doe John",4,378.50800000000004]
["Jane Mary",7,593.8599999999999]
["Kaploozie Suzie",6,1036.3599999999999]
["Liberace Mister",10,2432.2199999999998]
["N'Charge Charles",2,168.79]
["O'Lantern Jack",3,610.78]
["Pumpkineater Peter",7,609.86]
["Rhythm DJ",2,221.58]
["Wont William",14,1253.5700000000002]
["Grand Total",66,8760.1679999999997]
[]
["Price","(Multiple Items)","Items Priced Under $10"]
[]
["Row Labels","Sum of Total Purchased","Sum of Percent of Total Revenue","Sum of Total Per Item","Percentage of Total Revenue"]
["Better Socks",1,0.22577519379844962,6.99]
["Fuzzy Socks",1,0.29037467700258396,8.99]
["Socks",1,0.16117571059431524,4.99]
["Toe Socks",1,0.32267441860465118,9.99]
["Grand Total",4,1,30.96,{"$f":"GETPIVOTDATA(\"Sum of Total Per Item\",$A$19)/'Product Information'!$E$32","v":3.4867456365000114E-3}]
[]
[]
["Price","(Multiple Items)","Items Priced $10 to $100"]
[]
["Row Labels","Sum of Total Purchased","Sum of Percent of Total Revenue","Sum of Total Per Item","Percentage of Total Revenue"]
["Amazing Hat",0,0,0]
["Better Hat",0,0,0]
["Great Pants",7,0.22209106524847896,524.92999999999995]
["Great Shirt",1,2.3265554793998933E-2,54.99]
["Hard Hat",2,2.5376758984252699E-2,59.98]
["Hat",1,8.4575093713773163E-3,19.989999999999998]
["IOU Sunglasses",0,0,0]
["Logo Hat",10,0.21150119733624417,499.90000000000003]
["Nicer Pants",1,1.4803814552500866E-2,34.99]
["Nicer Shirt",0,0,0]
["Pants",1,1.0572944431751833E-2,24.99]
["Shirt",0,0,0]
["Shoes",0,0,0]
["Sunglasses",0,0,0]
["Super Sunglasses",10,0.42304470337369582,999.9]
["Thermal Socks",8,4.3967202294823954E-2,103.92]
["Top Hat",1,1.6919249612875383E-2,39.99]
["UV Sunglasses",0,0,0]
["Grand Total",42,1,2363.58,{"$f":"GETPIVOTDATA(\"Sum of Total Per Item\",$A$29)/'Product Information'!E32","v":0.26618870321442817}]
[]
[]
["Price","(Multiple Items)","Items Priced Over $100"]
[]
["Row Labels","Sum of Total Purchased","Sum of Percent of Total Revenue","Sum of Total Per Item","Percentage of Total Revenue"]
["Dressy Jacket",1,7.7101838144584253E-2,499.99]
["Fashionista Sunglasses",4,0.30840735257833701,1999.96]
["Great Shoes",0,0,0]
["Jacket",1,2.0816370589686651E-2,134.99]
["Leather Jacket",1,6.939150012336541E-2,449.99]
["Logo Jacket",1,0.15420521835677273,999.99]
["Nicer Shoes",0,0,0]
["Winter Jacket",12,0.37007772020725388,2399.88]
["Grand Total",20,1,6484.7999999999993,{"$f":"GETPIVOTDATA(\"Sum of Total Per Item\",$A$53)/'Product Information'!E32","v":0.73032455114907213}]

{"sheet":"Input Calculation","index":2,"n_rows":52,"n_cols":41,"rows_kept":52,"cut":false,"hidden":false,"merged":[]}
["Order Number","Phone Number","Customer Name","Date","State","Customer Since","New Information","Red Flag","Item 1","Price 1","Item 2","Price 2","Item 3","Price 3","Item 4","Price 4","Item 5","Price 5","Item 6","Price 6","Item 7","Price 7","Item 8","Price 8","Item 9","Price 9","Item 10","Price 10","Number of Items","Item Total","Loyalty Discount","Big Spender Discount","Sub Total","Shipping","Sales Tax","Grand Total",null,null,null,"State","Sales Tax"]
[{"$f":"IF(ISBLANK('Customer Input'!D2),\"\",ROW()+999)","v":1001},{"$f":"'Customer Input'!D2","v":6315790090},{"$f":"CONCATENATE('Customer Input'!C2,\" \",'Customer Input'!B2)","v":"Caputo Matthew"},{"$f":"'Customer Input'!A2","v":"2021-10-24"},{"$f":"'Customer Input'!H2","v":"TX"},{"$f":"VLOOKUP(B2,'Customer Information'!$A$2:$I$17,8)","v":2007},{"$f":"IF('Customer Input'!F2=VLOOKUP('Input Calculation'!B2,'Customer Information'!$A$2:$I$17,4),\"No\",\"Yes\")","v":"No"},{"$f":"IF(VLOOKUP(B2,'Customer Information'!$A$2:$I$17,9)=\"Yes\",\"\",\"Attn: Manager\")","v":""},{"$f":"IF(ISBLANK('Customer Input'!J2),\"\",'Customer Input'!J2)","v":7250412},{"$f":"IF(ISBLANK('Customer Input'!J2),\"\",VLOOKUP(I2,'Product Information'!$A$2:$C$31,3))","v":12.99},{"$f":"IF(ISBLANK('Customer Input'!K2),\"\",'Customer Input'!K2)","v":5216388},{"$f":"IF(ISBLANK('Customer Input'!K2),\"\",VLOOKUP(K2,'Product Information'!$A$2:$C$31,3))","v":49.99},{"$f":"IF(ISBLANK('Customer Input'!L2),\"\",'Customer Input'!L2)","v":9242514},{"$f":"IF(ISBLANK('Customer Input'!L2),\"\",VLOOKUP(M2,'Product Information'!$A$2:$C$31,3))","v":499.99},{"$f":"IF(ISBLANK('Customer Input'!M2),\"\",'Customer Input'!M2)","v":""},{"$f":"IF(ISBLANK('Customer Input'!M2),\"\",VLOOKUP(O2,'Product Information'!$A$2:$C$31,3))","v":""},{"$f":"IF(ISBLANK('Customer Input'!N2),\"\",'Customer Input'!N2)","v":""},{"$f":"IF(ISBLANK('Customer Input'!N2),\"\",VLOOKUP(Q2,'Product Information'!$A$2:$C$31,3))","v":""},{"$f":"IF(ISBLANK('Customer Input'!O2),\"\",'Customer Input'!O2)","v":""},{"$f":"IF(ISBLANK('Customer Input'!O2),\"\",VLOOKUP(S2,'Product Information'!$A$2:$C$31,3))","v":""},{"$f":"IF(ISBLANK('Customer Input'!P2),\"\",'Customer Input'!P2)","v":""},{"$f":"IF(ISBLANK('Customer Input'!P2),\"\",VLOOKUP(U2,'Product Information'!$A$2:$C$31,3))","v":""},{"$f":"IF(ISBLANK('Customer Input'!Q2),\"\",'Customer Input'!Q2)","v":""},{"$f":"IF(ISBLANK('Customer Input'!Q2),\"\",VLOOKUP(W2,'Product Information'!$A$2:$C$31,3))","v":""},{"$f":"IF(ISBLANK('Customer Input'!R2),\"\",'Customer Input'!R2)","v":""},{"$f":"IF(ISBLANK('Customer Input'!R2),\"\",VLOOKUP(Y2,'Product Information'!$A$2:$C$31,3))","v":""},{"$f":"IF(ISBLANK('Customer Input'!S2),\"\",'Customer Input'!S2)","v":""},{"$f":"IF(ISBLANK('Customer Input'!S2),\"\",VLOOKUP(AA2,'Product Information'!$A$2:$C$31,3))","v":""},{"$f":"COUNT(I2:AB2)/2","v":3},{"$f":"SUM(J2,L2,N2,P2,R2,T2,V2,X2,Z2,AB2)","v":562.97},{"$f":"IF(YEAR(D2)-F2>9,_xlfn.FLOOR.MATH(AD2*10)/100,0)","v":56.29},{"$f":"IF(MATCH(B2,'Order History'!V:V,0)=MAX('Order History'!A:A)-A2+2,0,IF(VLOOKUP(MATCH(B2,'Order History'!V:V,0)-1,'Order History'!$T$2:$AJ$11,17)>199,_xlfn.FLOOR.MATH(AD2*10)/100,0))","v":0},{"$f":"AD2-AE2-AF2","v":506.68},{"$f":"IF(OR(AE2>0,AF2>0),0,MIN(5,0.1*AG2))","v":0},{"$f":"_xlfn.FLOOR.MATH(VLOOKUP(E2,$AN$2:$AO$52,2)*AG2*100)/100","v":41.49},{"$f":"SUM(AG2:AI2)","v":548.16999999999996},null,null,null,"AK",1.7600000000000001E-2]
[{"$f":"IF(ISBLANK('Customer Input'!D3),\"\",ROW()+999)","v":1002},{"$f":"'Customer Input'!D3","v":8174368834},{"$f":"CONCATENATE('Customer Input'!C3,\" \",'Customer Input'!B3)","v":"Doe John"},{"$f":"'Customer Input'!A3","v":"2021-10-24"},{"$f":"'Customer Input'!H3","v":"CA"},{"$f":"VLOOKUP(B3,'Customer Information'!$A$2:$I$17,8)","v":2017},{"$f":"IF('Customer Input'!F3=VLOOKUP('Input Calculation'!B3,'Customer Information'!$A$2:$I$17,4),\"No\",\"Yes\")","v":"No"},{"$f":"IF(VLOOKUP(B3,'Customer Information'!$A$2:$I$17,9)=\"Yes\",\"\",\"Attn: Manager\")","v":""},{"$f":"IF(ISBLANK('Customer Input'!J3),\"\",'Customer Input'!J3)","v":2056772},{"$f":"IF(ISBLANK('Customer Input'!J3),\"\",VLOOKUP(I3,'Product Information'!$A$2:$C$31,3))","v":74.989999999999995},{"$f":"IF(ISBLANK('Customer Input'!K3),\"\",'Customer Input'!K3)","v":3055845},{"$f":"IF(ISBLANK('Customer Input'!K3),\"\",VLOOKUP(K3,'Product Information'!$A$2:$C$31,3))","v":199.99},{"$f":"IF(ISBLANK('Customer Input'!L3),\"\",'Customer Input'!L3)","v":""},{"$f":"IF(ISBLANK('Customer Input'!L3),\"\",VLOOKUP(M3,'Product Information'!$A$2:$C$31,3))","v":""},{"$f":"IF(ISBLANK('Customer Input'!M3),\"\",'Customer Input'!M3)","v":""},{"$f":"IF(ISBLANK('Customer Input'!M3),\"\",VLOOKUP(O3,'Product Information'!$A$2:$C$31,3))","v":""},{"$f":"IF(ISBLANK('Customer Input'!N3),\"\",'Customer Input'!N3)","v":""},{"$f":"IF(ISBLANK('Customer Input'!N3),\"\",VLOOKUP(Q3,'Product Information'!$A$2:$C$31,3))","v":""},{"$f":"IF(ISBLANK('Customer Input'!O3),\"\",'Customer Input'!O3)","v":""},{"$f":"IF(ISBLANK('Customer Input'!O3),\"\",VLOOKUP(S3,'Product Information'!$A$2:$C$31,3))","v":""},{"$f":"IF(ISBLANK('Customer Input'!P3),\"\",'Customer Input'!P3)","v":""},{"$f":"IF(ISBLANK('Customer Input'!P3),\"\",VLOOKUP(U3,'Product Information'!$A$2:$C$31,3))","v":""},{"$f":"IF(ISBLANK('Customer Input'!Q3),\"\",'Customer Input'!Q3)","v":""},{"$f":"IF(ISBLANK('Customer Input'!Q3),\"\",VLOOKUP(W3,'Product Information'!$A$2:$C$31,3))","v":""},{"$f":"IF(ISBLANK('Customer Input'!R3),\"\",'Customer Input'!R3)","v":""},{"$f":"IF(ISBLANK('Customer Input'!R3),\"\",VLOOKUP(Y3,'Product Information'!$A$2:$C$31,3))","v":""},{"$f":"IF(ISBLANK('Customer Input'!S3),\"\",'Customer Input'!S3)","v":""},{"$f":"IF(ISBLANK('Customer Input'!S3),\"\",VLOOKUP(AA3,'Product Information'!$A$2:$C$31,3))","v":""},{"$f":"COUNT(I3:AB3)/2","v":2},{"$f":"SUM(J3,L3,N3,P3,R3,T3,V3,X3,Z3,AB3)","v":274.98},{"$f":"IF(YEAR(D3)-F3>9,_xlfn.FLOOR.MATH(AD3*10)/100,0)","v":0},{"$f":"IF(MATCH(B3,'Order History'!V:V,0)=MAX('Order History'!A:A)-A3+2,0,IF(VLOOKUP(MATCH(B3,'Order History'!V:V,0)-1,'Order History'!$T$2:$AJ$11,17)>199,_xlfn.FLOOR.MATH(AD3*10)/100,0))","v":0},{"$f":"AD3-AE3-AF3","v":274.98},{"$f":"IF(OR(AE3>0,AF3>0),0,MIN(5,0.1*AG3))","v":5},{"$f":"_xlfn.FLOOR.MATH(VLOOKUP(E3,$AN$2:$AO$52,2)*AG3*100)/100","v":23.81},{"$f":"SUM(AG3:AI3)","v":303.79000000000002},null,null,null,"AL",9.2200000000000004E-2]
[{"$f":"IF(ISBLANK('Customer Input'!D4),\"\",ROW()+999)","v":1003},{"$f":"'Customer Input'!D4","v":7139892245},{"$f":"CONCATENATE('Customer Input'!C4,\" \",'Customer Input'!B4)","v":"Kaploozie Suzie"},{"$f":"'Customer Input'!A4","v":"2021-10-24"},{"$f":"'Customer Input'!H4","v":"NY"},{"$f":"VLOOKUP(B4,'Customer Information'!$A$2:$I$17,8)","v":2003},{"$f":"IF('Customer Input'!F4=VLOOKUP('Input Calculation'!B4,'Customer Information'!$A$2:$I$17,4),\"No\",\"Yes\")","v":"No"},{"$f":"IF(VLOOKUP(B4,'Customer Information'!$A$2:$I$17,9)=\"Yes\",\"\",\"Attn: Manager\")","v":""},{"$f":"IF(ISBLANK('Customer Input'!J4),\"\",'Customer Input'!J4)","v":3055845},{"$f":"IF(ISBLANK('Customer Input'!J4),\"\",VLOOKUP(I4,'Product Information'!$A$2:$C$31,3))","v":199.99},{"$f":"IF(ISBLANK('Customer Input'!K4),\"\",'Customer Input'!K4)","v":""},{"$f":"IF(ISBLANK('Customer Input'!K4),\"\",VLOOKUP(K4,'Product Information'!$A$2:$C$31,3))","v":""},{"$f":"IF(ISBLANK('Customer Input'!L4),\"\",'Customer Input'!L4)","v":""},{"$f":"IF(ISBLANK('Customer Input'!L4),\"\",VLOOKUP(M4,'Product Information'!$A$2:$C$31,3))","v":""},{"$f":"IF(ISBLANK('Customer Input'!M4),\"\",'Customer Input'!M4)","v":""},{"$f":"IF(ISBLANK('Customer Input'!M4),\"\",VLOOKUP(O4,'Product Information'!$A$2:$C$31,3))","v":""},{"$f":"IF(ISBLANK('Customer Input'!N4),\"\",'Customer Input'!N4)","v":""},{"$f":"IF(ISBLANK('Customer Input'!N4),\"\",VLOOKUP(Q4,'Product Information'!$A$2:$C$31,3))","v":""},{"$f":"IF(ISBLANK('Customer Input'!O4),\"\",'Customer Input'!O4)","v":""},{"$f":"IF(ISBLANK('Customer Input'!O4),\"\",VLOOKUP(S4,'Product Information'!$A$2:$C$31,3))","v":""},{"$f":"IF(ISBLANK('Customer Input'!P4),\"\",'Customer Input'!P4)","v":""},{"$f":"IF(ISBLANK('Customer Input'!P4),\"\",VLOOKUP(U4,'Product Information'!$A$2:$C$31,3))","v":""},{"$f":"IF(ISBLANK('Customer Input'!Q4),\"\",'Customer Input'!Q4)","v":""},{"$f":"IF(ISBLANK('Customer Input'!Q4),\"\",VLOOKUP(W4,'Product Information'!$A$2:$C$31,3))","v":""},{"$f":"IF(ISBLANK('Customer Input'!R4),\"\",'Customer Input'!R4)","v":""},{"$f":"IF(ISBLANK('Customer Input'!R4),\"\",VLOOKUP(Y4,'Product Information'!$A$2:$C$31,3))","v":""},{"$f":"IF(ISBLANK('Customer Input'!S4),\"\",'Customer Input'!S4)","v":""},{"$f":"IF(ISBLANK('Customer Input'!S4),\"\",VLOOKUP(AA4,'Product Information'!$A$2:$C$31,3))","v":""},1,199.99,19.989999999999998,{"$f":"IF(MATCH(B4,'Order History'!V:V,0)=MAX('Order History'!A:A)-A4+2,0,IF(VLOOKUP(MATCH(B4,'Order History'!V:V,0)-1,'Order History'!$T$2:$AJ$11,17)>199,_xlfn.FLOOR.MATH(AD4*10)/100,0))","v":19.989999999999998},160.01,0,13.63,173.64,null,null,null,"AR",9.4700000000000006E-2]
[{"$f":"IF(ISBLANK('Customer Input'!D5),\"\",ROW()+999)","v":1004},{"$f":"'Customer Input'!D5","v":9184329830},{"$f":"CONCATENATE('Customer Input'!C5,\" \",'Customer Input'!B5)","v":"Jane Mary"},{"$f":"'Customer Input'!A5","v":"2021-10-25"},{"$f":"'Customer Input'!H5","v":"CO"},{"$f":"VLOOKUP(B5,'Customer Information'!$A$2:$I$17,8)","v":2001},{"$f":"IF('Customer Input'!F5=VLOOKUP('Input Calculation'!B5,'Customer Information'!$A$2:$I$17,4),\"No\",\"Yes\")","v":"No"},{"$f":"IF(VLOOKUP(B5,'Customer Information'!$A$2:$I$17,9)=\"Yes\",\"\",\"Attn: Manager\")","v":"Attn: Manager"},{"$f":"IF(ISBLANK('Customer Input'!J5),\"\",'Customer Input'!J5)","v":8924251},{"$f":"IF(ISBLANK('Customer Input'!J5),\"\",VLOOKUP(I5,'Product Information'!$A$2:$C$31,3))","v":99.99},{"$f":"IF(ISBLANK('Customer Input'!K5),\"\",'Customer Input'!K5)","v":7250412},{"$f":"IF(ISBLANK('Customer Input'!K5),\"\",VLOOKUP(K5,'Product Information'!$A$2:$C$31,3))","v":12.99},{"$f":"IF(ISBLANK('Customer Input'!L5),\"\",'Customer Input'!L5)","v":5216388},{"$f":"IF(ISBLANK('Customer Input'!L5),\"\",VLOOKUP(M5,'Product Information'!$A$2:$C$31,3))","v":49.99},{"$f":"IF(ISBLANK('Customer Input'!M5),\"\",'Customer Input'!M5)","v":""},{"$f":"IF(ISBLANK('Customer Input'!M5),\"\",VLOOKUP(O5,'Product Information'!$A$2:$C$31,3))","v":""},{"$f":"IF(ISBLANK('Customer Input'!N5),\"\",'Customer Input'!N5)","v":""},{"$f":"IF(ISBLANK('Customer Input'!N5),\"\",VLOOKUP(Q5,'Product Information'!$A$2:$C$31,3))","v":""},{"$f":"IF(ISBLANK('Customer Input'!O5),\"\",'Customer Input'!O5)","v":""},{"$f":"IF(ISBLANK('Customer Input'!O5),\"\",VLOOKUP(S5,'Product Information'!$A$2:$C$31,3))","v":""},{"$f":"IF(ISBLANK('Customer Input'!P5),\"\",'Customer Input'!P5)","v":""},{"$f":"IF(ISBLANK('Customer Input'!P5),\"\",VLOOKUP(U5,'Product Information'!$A$2:$C$31,3))","v":""},{"$f":"IF(ISBLANK('Customer Input'!Q5),\"\",'Customer Input'!Q5)","v":""},{"$f":"IF(ISBLANK('Customer Input'!Q5),\"\",VLOOKUP(W5,'Product Information'!$A$2:$C$31,3))","v":""},{"$f":"IF(ISBLANK('Customer Input'!R5),\"\",'Customer Input'!R5)","v":""},{"$f":"IF(ISBLANK('Customer Input'!R5),\"\",VLOOKUP(Y5,'Product Information'!$A$2:$C$31,3))","v":""},{"$f":"IF(ISBLANK('Customer Input'!S5),\"\",'Customer Input'!S5)","v":""},{"$f":"IF(ISBLANK('Customer Input'!S5),\"\",VLOOKUP(AA5,'Product Information'!$A$2:$C$31,3))","v":""},3,162.97,16.29,{"$f":"IF(MATCH(B5,'Order History'!V:V,0)=MAX('Order History'!A:A)-A5+2,0,IF(VLOOKUP(MATCH(B5,'Order History'!V:V,0)-1,'Order History'!$T$2:$AJ$11,17)>199,_xlfn.FLOOR.MATH(AD5*10)/100,0))","v":0},146.68,0,11.22,157.9,null,null,null,"AZ",8.4000000000000005E-2]
[{"$f":"IF(ISBLANK('Customer Input'!D6),\"\",ROW()+999)","v":1005},{"$f":"'Customer Input'!D6","v":5168832323},{"$f":"CONCATENATE('Customer Input'!C6,\" \",'Customer Input'!B6)","v":"Wont William"},{"$f":"'Customer Input'!A6","v":"2021-10-25"},{"$f":"'Customer Input'!H6","v":"MO"},{"$f":"VLOOKUP(B6,'Customer Information'!$A$2:$I$17,8)","v":2020},{"$f":"IF('Customer Input'!F6=VLOOKUP('Input Calculation'!B6,'Customer Information'!$A$2:$I$17,4),\"No\",\"Yes\")","v":"No"},{"$f":"IF(VLOOKUP(B6,'Customer Information'!$A$2:$I$17,9)=\"Yes\",\"\",\"Attn: Manager\")","v":""},{"$f":"IF(ISBLANK('Customer Input'!J6),\"\",'Customer Input'!J6)","v":9242514},{"$f":"IF(ISBLANK('Customer Input'!J6),\"\",VLOOKUP(I6,'Product Information'!$A$2:$C$31,3))","v":499.99},{"$f":"IF(ISBLANK('Customer Input'!K6),\"\",'Customer Input'!K6)","v":3055845},{"$f":"IF(ISBLANK('Customer Input'!K6),\"\",VLOOKUP(K6,'Product Information'!$A$2:$C$31,3))","v":199.99},{"$f":"IF(ISBLANK('Customer Input'!L6),\"\",'Customer Input'!L6)","v":7250412},{"$f":"IF(ISBLANK('Customer Input'!L6),\"\",VLOOKUP(M6,'Product Information'!$A$2:$C$31,3))","v":12.99},{"$f":"IF(ISBLANK('Customer Input'!M6),\"\",'Customer Input'!M6)","v":""},{"$f":"IF(ISBLANK('Customer Input'!M6),\"\",VLOOKUP(O6,'Product Information'!$A$2:$C$31,3))","v":""},{"$f":"IF(ISBLANK('Customer Input'!N6),\"\",'Customer Input'!N6)","v":""},{"$f":"IF(ISBLANK('Customer Input'!N6),\"\",VLOOKUP(Q6,'Product Information'!$A$2:$C$31,3))","v":""},{"$f":"IF(ISBLANK('Customer Input'!O6),\"\",'Customer Input'!O6)","v":""},{"$f":"IF(ISBLANK('Customer Input'!O6),\"\",VLOOKUP(S6,'Product Information'!$A$2:$C$31,3))","v":""},{"$f":"IF(ISBLANK('Customer Input'!P6),\"\",'Customer Input'!P6)","v":""},{"$f":"IF(ISBLANK('Customer Input'!P6),\"\",VLOOKUP(U6,'Product Information'!$A$2:$C$31,3))","v":""},{"$f":"IF(ISBLANK('Customer Input'!Q6),\"\",'Customer Input'!Q6)","v":""},{"$f":"IF(ISBLANK('Customer Input'!Q6),\"\",VLOOKUP(W6,'Product Information'!$A$2:$C$31,3))","v":""},{"$f":"IF(ISBLANK('Customer Input'!R6),\"\",'Customer Input'!R6)","v":""},{"$f":"IF(ISBLANK('Customer Input'!R6),\"\",VLOOKUP(Y6,'Product Information'!$A$2:$C$31,3))","v":""},{"$f":"IF(ISBLANK('Customer Input'!S6),\"\",'Customer Input'!S6)","v":""},{"$f":"IF(ISBLANK('Customer Input'!S6),\"\",VLOOKUP(AA6,'Product Information'!$A$2:$C$31,3))","v":""},3,712.97,0,{"$f":"IF(MATCH(B6,'Order History'!V:V,0)=MAX('Order History'!A:A)-A6+2,0,IF(VLOOKUP(MATCH(B6,'Order History'!V:V,0)-1,'Order History'!$T$2:$AJ$11,17)>199,_xlfn.FLOOR.MATH(AD6*10)/100,0))","v":71.290000000000006},641.68000000000006,0,52.48,694.16000000000008,null,null,null,"CA",8.6599999999999996E-2]
[{"$f":"IF(ISBLANK('Customer Input'!D7),\"\",ROW()+999)","v":1006},{"$f":"'Customer Input'!D7","v":6530353532},{"$f":"CONCATENATE('Customer Input'!C7,\" \",'Customer Input'!B7)","v":"Pumpkineater Peter"},{"$f":"'Customer Input'!A7","v":"2021-10-25"},{"$f":"'Customer Input'!H7","v":"VT"},{"$f":"VLOOKUP(B7,'Customer Information'!$A$2:$I$17,8)","v":2008},{"$f":"IF('Customer Input'!F7=VLOOKUP('Input Calculation'!B7,'Customer Information'!$A$2:$I$17,4),\"No\",\"Yes\")","v":"No"},{"$f":"IF(VLOOKUP(B7,'Customer Information'!$A$2:$I$17,9)=\"Yes\",\"\",\"Attn: Manager\")","v":""},{"$f":"IF(ISBLANK('Customer Input'!J7),\"\",'Customer Input'!J7)","v":8924251},{"$f":"IF(ISBLANK('Customer Input'!J7),\"\",VLOOKUP(I7,'Product Information'!$A$2:$C$31,3))","v":99.99},{"$f":"IF(ISBLANK('Customer Input'!K7),\"\",'Customer Input'!K7)","v":7250412},{"$f":"IF(ISBLANK('Customer Input'!K7),\"\",VLOOKUP(K7,'Product Information'!$A$2:$C$31,3))","v":12.99},{"$f":"IF(ISBLANK('Customer Input'!L7),\"\",'Customer Input'!L7)","v":8924251},{"$f":"IF(ISBLANK('Customer Input'!L7),\"\",VLOOKUP(M7,'Product Information'!$A$2:$C$31,3))","v":99.99},{"$f":"IF(ISBLANK('Customer Input'!M7),\"\",'Customer Input'!M7)","v":""},{"$f":"IF(ISBLANK('Customer Input'!M7),\"\",VLOOKUP(O7,'Product Information'!$A$2:$C$31,3))","v":""},{"$f":"IF(ISBLANK('Customer Input'!N7),\"\",'Customer Input'!N7)","v":""},{"$f":"IF(ISBLANK('Customer Input'!N7),\"\",VLOOKUP(Q7,'Product Information'!$A$2:$C$31,3))","v":""},{"$f":"IF(ISBLANK('Customer Input'!O7),\"\",'Customer Input'!O7)","v":""},{"$f":"IF(ISBLANK('Customer Input'!O7),\"\",VLOOKUP(S7,'Product Information'!$A$2:$C$31,3))","v":""},{"$f":"IF(ISBLANK('Customer Input'!P7),\"\",'Customer Input'!P7)","v":""},{"$f":"IF(ISBLANK('Customer Input'!P7),\"\",VLOOKUP(U7,'Product Information'!$A$2:$C$31,3))","v":""},{"$f":"IF(ISBLANK('Customer Input'!Q7),\"\",'Customer Input'!Q7)","v":""},{"$f":"IF(ISBLANK('Customer Input'!Q7),\"\",VLOOKUP(W7,'Product Information'!$A$2:$C$31,3))","v":""},{"$f":"IF(ISBLANK('Customer Input'!R7),\"\",'Customer Input'!R7)","v":""},{"$f":"IF(ISBLANK('Customer Input'!R7),\"\",VLOOKUP(Y7,'Product Information'!$A$2:$C$31,3))","v":""},{"$f":"IF(ISBLANK('Customer Input'!S7),\"\",'Customer Input'!S7)","v":""},{"$f":"IF(ISBLANK('Customer Input'!S7),\"\",VLOOKUP(AA7,'Product Information'!$A$2:$C$31,3))","v":""},3,212.96999999999997,21.29,{"$f":"IF(MATCH(B7,'Order History'!V:V,0)=MAX('Order History'!A:A)-A7+2,0,IF(VLOOKUP(MATCH(B7,'Order History'!V:V,0)-1,'Order History'!$T$2:$AJ$11,17)>199,_xlfn.FLOOR.MATH(AD7*10)/100,0))","v":0},191.67999999999998,0,11.92,203.59999999999997,null,null,null,"CO",7.6499999999999999E-2]
[{"$f":"IF(ISBLANK('Customer Input'!D8),\"\",ROW()+999)","v":1007},{"$f":"'Customer Input'!D8","v":8785546312},{"$f":"CONCATENATE('Customer Input'!C8,\" \",'Customer Input'!B8)","v":"O'Lantern Jack"},{"$f":"'Customer Input'!A8","v":"2021-10-25"},{"$f":"'Customer Input'!H8","v":"MO"},{"$f":"VLOOKUP(B8,'Customer Information'!$A$2:$I$17,8)","v":2017},{"$f":"IF('Customer Input'!F8=VLOOKUP('Input Calculation'!B8,'Customer Information'!$A$2:$I$17,4),\"No\",\"Yes\")","v":"No"},{"$f":"IF(VLOOKUP(B8,'Customer Information'!$A$2:$I$17,9)=\"Yes\",\"\",\"Attn: Manager\")","v":"Attn: Manager"},{"$f":"IF(ISBLANK('Customer Input'!J8),\"\",'Customer Input'!J8)","v":3055845},{"$f":"IF(ISBLANK('Customer Input'!J8),\"\",VLOOKUP(I8,'Product Information'!$A$2:$C$31,3))","v":199.99},{"$f":"IF(ISBLANK('Customer Input'!K8),\"\",'Customer Input'!K8)","v":""},{"$f":"IF(ISBLANK('Customer Input'!K8),\"\",VLOOKUP(K8,'Product Information'!$A$2:$C$31,3))","v":""},{"$f":"IF(ISBLANK('Customer Input'!L8),\"\",'Customer Input'!L8)","v":""},{"$f":"IF(ISBLANK('Customer Input'!L8),\"\",VLOOKUP(M8,'Product Information'!$A$2:$C$31,3))","v":""},{"$f":"IF(ISBLANK('Customer Input'!M8),\"\",'Customer Input'!M8)","v":""},{"$f":"IF(ISBLANK('Customer Input'!M8),\"\",VLOOKUP(O8,'Product Information'!$A$2:$C$31,3))","v":""},{"$f":"IF(ISBLANK('Customer Input'!N8),\"\",'Customer Input'!N8)","v":""},{"$f":"IF(ISBLANK('Customer Input'!N8),\"\",VLOOKUP(Q8,'Product Information'!$A$2:$C$31,3))","v":""},{"$f":"IF(ISBLANK('Customer Input'!O8),\"\",'Customer Input'!O8)","v":""},{"$f":"IF(ISBLANK('Customer Input'!O8),\"\",VLOOKUP(S8,'Product Information'!$A$2:$C$31,3))","v":""},{"$f":"IF(ISBLANK('Customer Input'!P8),\"\",'Customer Input'!P8)","v":""},{"$f":"IF(ISBLANK('Customer Input'!P8),\"\",VLOOKUP(U8,'Product Information'!$A$2:$C$31,3))","v":""},{"$f":"IF(ISBLANK('Customer Input'!Q8),\"\",'Customer Input'!Q8)","v":""},{"$f":"IF(ISBLANK('Customer Input'!Q8),\"\",VLOOKUP(W8,'Product Information'!$A$2:$C$31,3))","v":""},{"$f":"IF(ISBLANK('Customer Input'!R8),\"\",'Customer Input'!R8)","v":""},{"$f":"IF(ISBLANK('Customer Input'!R8),\"\",VLOOKUP(Y8,'Product Information'!$A$2:$C$31,3))","v":""},{"$f":"IF(ISBLANK('Customer Input'!S8),\"\",'Customer Input'!S8)","v":""},{"$f":"IF(ISBLANK('Customer Input'!S8),\"\",VLOOKUP(AA8,'Product Information'!$A$2:$C$31,3))","v":""},1,199.99,0,{"$f":"IF(MATCH(B8,'Order History'!V:V,0)=MAX('Order History'!A:A)-A8+2,0,IF(VLOOKUP(MATCH(B8,'Order History'!V:V,0)-1,'Order History'!$T$2:$AJ$11,17)>199,_xlfn.FLOOR.MATH(AD8*10)/100,0))","v":19.989999999999998},180,0,14.72,194.72,null,null,null,"CT",6.3500000000000001E-2]
[{"$f":"IF(ISBLANK('Customer Input'!D9),\"\",ROW()+999)","v":1008},{"$f":"'Customer Input'!D9","v":9184329830},{"$f":"CONCATENATE('Customer Input'!C9,\" \",'Customer Input'!B9)","v":"Jane Mary"},{"$f":"'Customer Input'!A9","v":"2021-10-26"},{"$f":"'Customer Input'!H9","v":"CO"},{"$f":"VLOOKUP(B9,'Customer Information'!$A$2:$I$17,8)","v":2001},{"$f":"IF('Customer Input'!F9=VLOOKUP('Input Calculation'!B9,'Customer Information'!$A$2:$I$17,4),\"No\",\"Yes\")","v":"No"},{"$f":"IF(VLOOKUP(B9,'Customer Information'!$A$2:$I$17,9)=\"Yes\",\"\",\"Attn: Manager\")","v":"Attn: Manager"},{"$f":"IF(ISBLANK('Customer Input'!J9),\"\",'Customer Input'!J9)","v":8924251},{"$f":"IF(ISBLANK('Customer Input'!J9),\"\",VLOOKUP(I9,'Product Information'!$A$2:$C$31,3))","v":99.99},{"$f":"IF(ISBLANK('Customer Input'!K9),\"\",'Customer Input'!K9)","v":2056772},{"$f":"IF(ISBLANK('Customer Input'!K9),\"\",VLOOKUP(K9,'Product Information'!$A$2:$C$31,3))","v":74.989999999999995},{"$f":"IF(ISBLANK('Customer Input'!L9),\"\",'Customer Input'!L9)","v":""},{"$f":"IF(ISBLANK('Customer Input'!L9),\"\",VLOOKUP(M9,'Product Information'!$A$2:$C$31,3))","v":""},{"$f":"IF(ISBLANK('Customer Input'!M9),\"\",'Customer Input'!M9)","v":""},{"$f":"IF(ISBLANK('Customer Input'!M9),\"\",VLOOKUP(O9,'Product Information'!$A$2:$C$31,3))","v":""},{"$f":"IF(ISBLANK('Customer Input'!N9),\"\",'Customer Input'!N9)","v":""},{"$f":"IF(ISBLANK('Customer Input'!N9),\"\",VLOOKUP(Q9,'Product Information'!$A$2:$C$31,3))","v":""},{"$f":"IF(ISBLANK('Customer Input'!O9),\"\",'Customer Input'!O9)","v":""},{"$f":"IF(ISBLANK('Customer Input'!O9),\"\",VLOOKUP(S9,'Product Information'!$A$2:$C$31,3))","v":""},{"$f":"IF(ISBLANK('Customer Input'!P9),\"\",'Customer Input'!P9)","v":""},{"$f":"IF(ISBLANK('Customer Input'!P9),\"\",VLOOKUP(U9,'Product Information'!$A$2:$C$31,3))","v":""},{"$f":"IF(ISBLANK('Customer Input'!Q9),\"\",'Customer Input'!Q9)","v":""},{"$f":"IF(ISBLANK('Customer Input'!Q9),\"\",VLOOKUP(W9,'Product Information'!$A$2:$C$31,3))","v":""},{"$f":"IF(ISBLANK('Customer Input'!R9),\"\",'Customer Input'!R9)","v":""},{"$f":"IF(ISBLANK('Customer Input'!R9),\"\",VLOOKUP(Y9,'Product Information'!$A$2:$C$31,3))","v":""},{"$f":"IF(ISBLANK('Customer Input'!S9),\"\",'Customer Input'!S9)","v":""},{"$f":"IF(ISBLANK('Customer Input'!S9),\"\",VLOOKUP(AA9,'Product Information'!$A$2:$C$31,3))","v":""},2,174.98,17.489999999999998,{"$f":"IF(MATCH(B9,'Order History'!V:V,0)=MAX('Order History'!A:A)-A9+2,0,IF(VLOOKUP(MATCH(B9,'Order History'!V:V,0)-1,'Order History'!$T$2:$AJ$11,17)>199,_xlfn.FLOOR.MATH(AD9*10)/100,0))","v":0},157.48999999999998,0,12.04,169.52999999999997,null,null,null,"DC",0.06]
[{"$f":"IF(ISBLANK('Customer Input'!D10),\"\",ROW()+999)","v":1009},{"$f":"'Customer Input'!D10","v":7139892245},{"$f":"CONCATENATE('Customer Input'!C10,\" \",'Customer Input'!B10)","v":"Kaploozie Suzie"},{"$f":"'Customer Input'!A10","v":"2021-10-26"},{"$f":"'Customer Input'!H10","v":"NY"},{"$f":"VLOOKUP(B10,'Customer Information'!$A$2:$I$17,8)","v":2003},{"$f":"IF('Customer Input'!F10=VLOOKUP('Input Calculation'!B10,'Customer Information'!$A$2:$I$17,4),\"No\",\"Yes\")","v":"No"},{"$f":"IF(VLOOKUP(B10,'Customer Information'!$A$2:$I$17,9)=\"Yes\",\"\",\"Attn: Manager\")","v":""},{"$f":"IF(ISBLANK('Customer Input'!J10),\"\",'Customer Input'!J10)","v":2056772},{"$f":"IF(ISBLANK('Customer Input'!J10),\"\",VLOOKUP(I10,'Product Information'!$A$2:$C$31,3))","v":74.989999999999995},{"$f":"IF(ISBLANK('Customer Input'!K10),\"\",'Customer Input'!K10)","v":""},{"$f":"IF(ISBLANK('Customer Input'!K10),\"\",VLOOKUP(K10,'Product Information'!$A$2:$C$31,3))","v":""},{"$f":"IF(ISBLANK('Customer Input'!L10),\"\",'Customer Input'!L10)","v":""},{"$f":"IF(ISBLANK('Customer Input'!L10),\"\",VLOOKUP(M10,'Product Information'!$A$2:$C$31,3))","v":""},{"$f":"IF(ISBLANK('Customer Input'!M10),\"\",'Customer Input'!M10)","v":""},{"$f":"IF(ISBLANK('Customer Input'!M10),\"\",VLOOKUP(O10,'Product Information'!$A$2:$C$31,3))","v":""},{"$f":"IF(ISBLANK('Customer Input'!N10),\"\",'Customer Input'!N10)","v":""},{"$f":"IF(ISBLANK('Customer Input'!N10),\"\",VLOOKUP(Q10,'Product Information'!$A$2:$C$31,3))","v":""},{"$f":"IF(ISBLANK('Customer Input'!O10),\"\",'Customer Input'!O10)","v":""},{"$f":"IF(ISBLANK('Customer Input'!O10),\"\",VLOOKUP(S10,'Product Information'!$A$2:$C$31,3))","v":""},{"$f":"IF(ISBLANK('Customer Input'!P10),\"\",'Customer Input'!P10)","v":""},{"$f":"IF(ISBLANK('Customer Input'!P10),\"\",VLOOKUP(U10,'Product Information'!$A$2:$C$31,3))","v":""},{"$f":"IF(ISBLANK('Customer Input'!Q10),\"\",'Customer Input'!Q10)","v":""},{"$f":"IF(ISBLANK('Customer Input'!Q10),\"\",VLOOKUP(W10,'Product Information'!$A$2:$C$31,3))","v":""},{"$f":"IF(ISBLANK('Customer Input'!R10),\"\",'Customer Input'!R10)","v":""},{"$f":"IF(ISBLANK('Customer Input'!R10),\"\",VLOOKUP(Y10,'Product Information'!$A$2:$C$31,3))","v":""},{"$f":"IF(ISBLANK('Customer Input'!S10),\"\",'Customer Input'!S10)","v":""},{"$f":"IF(ISBLANK('Customer Input'!S10),\"\",VLOOKUP(AA10,'Product Information'!$A$2:$C$31,3))","v":""},1,74.989999999999995,7.49,{"$f":"IF(MATCH(B10,'Order History'!V:V,0)=MAX('Order History'!A:A)-A10+2,0,IF(VLOOKUP(MATCH(B10,'Order History'!V:V,0)-1,'Order History'!$T$2:$AJ$11,17)>199,_xlfn.FLOOR.MATH(AD10*10)/100,0))","v":7.49},60.01,0,5.1100000000000003,65.12,null,null,null,"DE",0]
[{"$f":"IF(ISBLANK('Customer Input'!D11),\"\",ROW()+999)","v":1010},{"$f":"'Customer Input'!D11","v":6530353532},{"$f":"CONCATENATE('Customer Input'!C11,\" \",'Customer Input'!B11)","v":"Pumpkineater Peter"},{"$f":"'Customer Input'!A11","v":"2021-10-26"},{"$f":"'Customer Input'!H11","v":"VT"},{"$f":"VLOOKUP(B11,'Customer Information'!$A$2:$I$17,8)","v":2008},{"$f":"IF('Customer Input'!F11=VLOOKUP('Input Calculation'!B11,'Customer Information'!$A$2:$I$17,4),\"No\",\"Yes\")","v":"No"},{"$f":"IF(VLOOKUP(B11,'Customer Information'!$A$2:$I$17,9)=\"Yes\",\"\",\"Attn: Manager\")","v":""},{"$f":"IF(ISBLANK('Customer Input'!J11),\"\",'Customer Input'!J11)","v":3055845},{"$f":"IF(ISBLANK('Customer Input'!J11),\"\",VLOOKUP(I11,'Product Information'!$A$2:$C$31,3))","v":199.99},{"$f":"IF(ISBLANK('Customer Input'!K11),\"\",'Customer Input'!K11)","v":2056772},{"$f":"IF(ISBLANK('Customer Input'!K11),\"\",VLOOKUP(K11,'Product Information'!$A$2:$C$31,3))","v":74.989999999999995},{"$f":"IF(ISBLANK('Customer Input'!L11),\"\",'Customer Input'!L11)","v":5216388},{"$f":"IF(ISBLANK('Customer Input'!L11),\"\",VLOOKUP(M11,'Product Information'!$A$2:$C$31,3))","v":49.99},{"$f":"IF(ISBLANK('Customer Input'!M11),\"\",'Customer Input'!M11)","v":""},{"$f":"IF(ISBLANK('Customer Input'!M11),\"\",VLOOKUP(O11,'Product Information'!$A$2:$C$31,3))","v":""},{"$f":"IF(ISBLANK('Customer Input'!N11),\"\",'Customer Input'!N11)","v":""},{"$f":"IF(ISBLANK('Customer Input'!N11),\"\",VLOOKUP(Q11,'Product Information'!$A$2:$C$31,3))","v":""},{"$f":"IF(ISBLANK('Customer Input'!O11),\"\",'Customer Input'!O11)","v":""},{"$f":"IF(ISBLANK('Customer Input'!O11),\"\",VLOOKUP(S11,'Product Information'!$A$2:$C$31,3))","v":""},{"$f":"IF(ISBLANK('Customer Input'!P11),\"\",'Customer Input'!P11)","v":""},{"$f":"IF(ISBLANK('Customer Input'!P11),\"\",VLOOKUP(U11,'Product Information'!$A$2:$C$31,3))","v":""},{"$f":"IF(ISBLANK('Customer Input'!Q11),\"\",'Customer Input'!Q11)","v":""},{"$f":"IF(ISBLANK('Customer Input'!Q11),\"\",VLOOKUP(W11,'Product Information'!$A$2:$C$31,3))","v":""},{"$f":"IF(ISBLANK('Customer Input'!R11),\"\",'Customer Input'!R11)","v":""},{"$f":"IF(ISBLANK('Customer Input'!R11),\"\",VLOOKUP(Y11,'Product Information'!$A$2:$C$31,3))","v":""},{"$f":"IF(ISBLANK('Customer Input'!S11),\"\",'Customer Input'!S11)","v":""},{"$f":"IF(ISBLANK('Customer Input'!S11),\"\",VLOOKUP(AA11,'Product Information'!$A$2:$C$31,3))","v":""},3,324.97000000000003,32.49,{"$f":"IF(MATCH(B11,'Order History'!V:V,0)=MAX('Order History'!A:A)-A11+2,0,IF(VLOOKUP(MATCH(B11,'Order History'!V:V,0)-1,'Order History'!$T$2:$AJ$11,17)>199,_xlfn.FLOOR.MATH(AD11*10)/100,0))","v":0},292.48,0,18.190000000000001,310.67,null,null,null,"FL",7.0499999999999993E-2]
[{"$f":"IF(ISBLANK('Customer Input'!D12),\"\",ROW()+999)","v":1011},{"$f":"'Customer Input'!D12","v":4438641204},{"$f":"CONCATENATE('Customer Input'!C12,\" \",'Customer Input'!B12)","v":"Calendar Marie"},{"$f":"'Customer Input'!A12","v":"2021-10-27"},{"$f":"'Customer Input'!H12","v":"MI"},{"$f":"VLOOKUP(B12,'Customer Information'!$A$2:$I$17,8)","v":2021},{"$f":"IF('Customer Input'!F12=VLOOKUP('Input Calculation'!B12,'Customer Information'!$A$2:$I$17,4),\"No\",\"Yes\")","v":"No"},{"$f":"IF(VLOOKUP(B12,'Customer Information'!$A$2:$I$17,9)=\"Yes\",\"\",\"Attn: Manager\")","v":""},{"$f":"IF(ISBLANK('Customer Input'!J12),\"\",'Customer Input'!J12)","v":5216388},{"$f":"IF(ISBLANK('Customer Input'!J12),\"\",VLOOKUP(I12,'Product Information'!$A$2:$C$31,3))","v":49.99},{"$f":"IF(ISBLANK('Customer Input'!K12),\"\",'Customer Input'!K12)","v":7250412},{"$f":"IF(ISBLANK('Customer Input'!K12),\"\",VLOOKUP(K12,'Product Information'!$A$2:$C$31,3))","v":12.99},{"$f":"IF(ISBLANK('Customer Input'!L12),\"\",'Customer Input'!L12)","v":9242514},{"$f":"IF(ISBLANK('Customer Input'!L12),\"\",VLOOKUP(M12,'Product Information'!$A$2:$C$31,3))","v":499.99},{"$f":"IF(ISBLANK('Customer Input'!M12),\"\",'Customer Input'!M12)","v":""},{"$f":"IF(ISBLANK('Customer Input'!M12),\"\",VLOOKUP(O12,'Product Information'!$A$2:$C$31,3))","v":""},{"$f":"IF(ISBLANK('Customer Input'!N12),\"\",'Customer Input'!N12)","v":""},{"$f":"IF(ISBLANK('Customer Input'!N12),\"\",VLOOKUP(Q12,'Product Information'!$A$2:$C$31,3))","v":""},{"$f":"IF(ISBLANK('Customer Input'!O12),\"\",'Customer Input'!O12)","v":""},{"$f":"IF(ISBLANK('Customer Input'!O12),\"\",VLOOKUP(S12,'Product Information'!$A$2:$C$31,3))","v":""},{"$f":"IF(ISBLANK('Customer Input'!P12),\"\",'Customer Input'!P12)","v":""},{"$f":"IF(ISBLANK('Customer Input'!P12),\"\",VLOOKUP(U12,'Product Information'!$A$2:$C$31,3))","v":""},{"$f":"IF(ISBLANK('Customer Input'!Q12),\"\",'Customer Input'!Q12)","v":""},{"$f":"IF(ISBLANK('Customer Input'!Q12),\"\",VLOOKUP(W12,'Product Information'!$A$2:$C$31,3))","v":""},{"$f":"IF(ISBLANK('Customer Input'!R12),\"\",'Customer Input'!R12)","v":""},{"$f":"IF(ISBLANK('Customer Input'!R12),\"\",VLOOKUP(Y12,'Product Information'!$A$2:$C$31,3))","v":""},{"$f":"IF(ISBLANK('Customer Input'!S12),\"\",'Customer Input'!S12)","v":""},{"$f":"IF(ISBLANK('Customer Input'!S12),\"\",VLOOKUP(AA12,'Product Information'!$A$2:$C$31,3))","v":""},3,562.97,0,{"$f":"IF(MATCH(B12,'Order History'!V:V,0)=MAX('Order History'!A:A)-A12+2,0,IF(VLOOKUP(MATCH(B12,'Order History'!V:V,0)-1,'Order History'!$T$2:$AJ$11,17)>199,_xlfn.FLOOR.MATH(AD12*10)/100,0))","v":0},562.97,5,33.770000000000003,601.74,null,null,null,"GA",7.3099999999999998E-2]
[{"$f":"IF(ISBLANK('Customer Input'!D13),\"\",ROW()+999)","v":1012},{"$f":"'Customer Input'!D13","v":7139892245},{"$f":"CONCATENATE('Customer Input'!C13,\" \",'Customer Input'!B13)","v":"Kaploozie Suzie"},{"$f":"'Customer Input'!A13","v":"2021-10-27"},{"$f":"'Customer Input'!H13","v":"NY"},{"$f":"VLOOKUP(B13,'Customer Information'!$A$2:$I$17,8)","v":2003},{"$f":"IF('Customer Input'!F13=VLOOKUP('Input Calculation'!B13,'Customer Information'!$A$2:$I$17,4),\"No\",\"Yes\")","v":"No"},{"$f":"IF(VLOOKUP(B13,'Customer Information'!$A$2:$I$17,9)=\"Yes\",\"\",\"Attn: Manager\")","v":""},{"$f":"IF(ISBLANK('Customer Input'!J13),\"\",'Customer Input'!J13)","v":3055845},{"$f":"IF(ISBLANK('Customer Input'!J13),\"\",VLOOKUP(I13,'Product Information'!$A$2:$C$31,3))","v":199.99},{"$f":"IF(ISBLANK('Customer Input'!K13),\"\",'Customer Input'!K13)","v":8924251},{"$f":"IF(ISBLANK('Customer Input'!K13),\"\",VLOOKUP(K13,'Product Information'!$A$2:$C$31,3))","v":99.99},{"$f":"IF(ISBLANK('Customer Input'!L13),\"\",'Customer Input'!L13)","v":""},{"$f":"IF(ISBLANK('Customer Input'!L13),\"\",VLOOKUP(M13,'Product Information'!$A$2:$C$31,3))","v":""},{"$f":"IF(ISBLANK('Customer Input'!M13),\"\",'Customer Input'!M13)","v":""},{"$f":"IF(ISBLANK('Customer Input'!M13),\"\",VLOOKUP(O13,'Product Information'!$A$2:$C$31,3))","v":""},{"$f":"IF(ISBLANK('Customer Input'!N13),\"\",'Customer Input'!N13)","v":""},{"$f":"IF(ISBLANK('Customer Input'!N13),\"\",VLOOKUP(Q13,'Product Information'!$A$2:$C$31,3))","v":""},{"$f":"IF(ISBLANK('Customer Input'!O13),\"\",'Customer Input'!O13)","v":""},{"$f":"IF(ISBLANK('Customer Input'!O13),\"\",VLOOKUP(S13,'Product Information'!$A$2:$C$31,3))","v":""},{"$f":"IF(ISBLANK('Customer Input'!P13),\"\",'Customer Input'!P13)","v":""},{"$f":"IF(ISBLANK('Customer Input'!P13),\"\",VLOOKUP(U13,'Product Information'!$A$2:$C$31,3))","v":""},{"$f":"IF(ISBLANK('Customer Input'!Q13),\"\",'Customer Input'!Q13)","v":""},{"$f":"IF(ISBLANK('Customer Input'!Q13),\"\",VLOOKUP(W13,'Product Information'!$A$2:$C$31,3))","v":""},{"$f":"IF(ISBLANK('Customer Input'!R13),\"\",'Customer Input'!R13)","v":""},{"$f":"IF(ISBLANK('Customer Input'!R13),\"\",VLOOKUP(Y13,'Product Information'!$A$2:$C$31,3))","v":""},{"$f":"IF(ISBLANK('Customer Input'!S13),\"\",'Customer Input'!S13)","v":""},{"$f":"IF(ISBLANK('Customer Input'!S13),\"\",VLOOKUP(AA13,'Product Information'!$A$2:$C$31,3))","v":""},2,299.98,29.99,{"$f":"IF(MATCH(B13,'Order History'!V:V,0)=MAX('Order History'!A:A)-A13+2,0,IF(VLOOKUP(MATCH(B13,'Order History'!V:V,0)-1,'Order History'!$T$2:$AJ$11,17)>199,_xlfn.FLOOR.MATH(AD13*10)/100,0))","v":29.99},240,0,20.440000000000001,260.44,null,null,null,"HI",4.4400000000000002E-2]
[{"$f":"IF(ISBLANK('Customer Input'!D14),\"\",ROW()+999)","v":1013},{"$f":"'Customer Input'!D14","v":5168832323},{"$f":"CONCATENATE('Customer Input'!C14,\" \",'Customer Input'!B14)","v":"Wont William"},{"$f":"'Customer Input'!A14","v":"2021-10-27"},{"$f":"'Customer Input'!H14","v":"MO"},{"$f":"VLOOKUP(B14,'Customer Information'!$A$2:$I$17,8)","v":2020},{"$f":"IF('Customer Input'!F14=VLOOKUP('Input Calculation'!B14,'Customer Information'!$A$2:$I$17,4),\"No\",\"Yes\")","v":"No"},{"$f":"IF(VLOOKUP(B14,'Customer Information'!$A$2:$I$17,9)=\"Yes\",\"\",\"Attn: Manager\")","v":""},{"$f":"IF(ISBLANK('Customer Input'!J14),\"\",'Customer Input'!J14)","v":8924251},{"$f":"IF(ISBLANK('Customer Input'!J14),\"\",VLOOKUP(I14,'Product Information'!$A$2:$C$31,3))","v":99.99},{"$f":"IF(ISBLANK('Customer Input'!K14),\"\",'Customer Input'!K14)","v":4989600},{"$f":"IF(ISBLANK('Customer Input'!K14),\"\",VLOOKUP(K14,'Product Information'!$A$2:$C$31,3))","v":29.99},{"$f":"IF(ISBLANK('Customer Input'!L14),\"\",'Customer Input'!L14)","v":5086187},{"$f":"IF(ISBLANK('Customer Input'!L14),\"\",VLOOKUP(M14,'Product Information'!$A$2:$C$31,3))","v":39.99},{"$f":"IF(ISBLANK('Customer Input'!M14),\"\",'Customer Input'!M14)","v":5216388},{"$f":"IF(ISBLANK('Customer Input'!M14),\"\",VLOOKUP(O14,'Product Information'!$A$2:$C$31,3))","v":49.99},{"$f":"IF(ISBLANK('Customer Input'!N14),\"\",'Customer Input'!N14)","v":6671819},{"$f":"IF(ISBLANK('Customer Input'!N14),\"\",VLOOKUP(Q14,'Product Information'!$A$2:$C$31,3))","v":4.99},{"$f":"IF(ISBLANK('Customer Input'!O14),\"\",'Customer Input'!O14)","v":6738313},{"$f":"IF(ISBLANK('Customer Input'!O14),\"\",VLOOKUP(S14,'Product Information'!$A$2:$C$31,3))","v":6.99},{"$f":"IF(ISBLANK('Customer Input'!P14),\"\",'Customer Input'!P14)","v":6808398},{"$f":"IF(ISBLANK('Customer Input'!P14),\"\",VLOOKUP(U14,'Product Information'!$A$2:$C$31,3))","v":8.99},{"$f":"IF(ISBLANK('Customer Input'!Q14),\"\",'Customer Input'!Q14)","v":6832283},{"$f":"IF(ISBLANK('Customer Input'!Q14),\"\",VLOOKUP(W14,'Product Information'!$A$2:$C$31,3))","v":9.99},{"$f":"IF(ISBLANK('Customer Input'!R14),\"\",'Customer Input'!R14)","v":7250412},{"$f":"IF(ISBLANK('Customer Input'!R14),\"\",VLOOKUP(Y14,'Product Information'!$A$2:$C$31,3))","v":12.99},{"$f":"IF(ISBLANK('Customer Input'!S14),\"\",'Customer Input'!S14)","v":""},{"$f":"IF(ISBLANK('Customer Input'!S14),\"\",VLOOKUP(AA14,'Product Information'!$A$2:$C$31,3))","v":""},9,263.91000000000003,0,{"$f":"IF(MATCH(B14,'Order History'!V:V,0)=MAX('Order History'!A:A)-A14+2,0,IF(VLOOKUP(MATCH(B14,'Order History'!V:V,0)-1,'Order History'!$T$2:$AJ$11,17)>199,_xlfn.FLOOR.MATH(AD14*10)/100,0))","v":26.39},237.52000000000004,0,19.420000000000002,256.94000000000005,null,null,null,"IA",6.9400000000000003E-2]
[{"$f":"IF(ISBLANK('Customer Input'!D15),\"\",ROW()+999)","v":1014},{"$f":"'Customer Input'!D15","v":8174368834},{"$f":"CONCATENATE('Customer Input'!C15,\" \",'Customer Input'!B15)","v":"Doe John"},{"$f":"'Customer Input'!A15","v":"2021-10-27"},{"$f":"'Customer Input'!H15","v":"CA"},{"$f":"VLOOKUP(B15,'Customer Information'!$A$2:$I$17,8)","v":2017},{"$f":"IF('Customer Input'!F15=VLOOKUP('Input Calculation'!B15,'Customer Information'!$A$2:$I$17,4),\"No\",\"Yes\")","v":"No"},{"$f":"IF(VLOOKUP(B15,'Customer Information'!$A$2:$I$17,9)=\"Yes\",\"\",\"Attn: Manager\")","v":""},{"$f":"IF(ISBLANK('Customer Input'!J15),\"\",'Customer Input'!J15)","v":7250412},{"$f":"IF(ISBLANK('Customer Input'!J15),\"\",VLOOKUP(I15,'Product Information'!$A$2:$C$31,3))","v":12.99},{"$f":"IF(ISBLANK('Customer Input'!K15),\"\",'Customer Input'!K15)","v":""},{"$f":"IF(ISBLANK('Customer Input'!K15),\"\",VLOOKUP(K15,'Product Information'!$A$2:$C$31,3))","v":""},{"$f":"IF(ISBLANK('Customer Input'!L15),\"\",'Customer Input'!L15)","v":""},{"$f":"IF(ISBLANK('Customer Input'!L15),\"\",VLOOKUP(M15,'Product Information'!$A$2:$C$31,3))","v":""},{"$f":"IF(ISBLANK('Customer Input'!M15),\"\",'Customer Input'!M15)","v":""},{"$f":"IF(ISBLANK('Customer Input'!M15),\"\",VLOOKUP(O15,'Product Information'!$A$2:$C$31,3))","v":""},{"$f":"IF(ISBLANK('Customer Input'!N15),\"\",'Customer Input'!N15)","v":""},{"$f":"IF(ISBLANK('Customer Input'!N15),\"\",VLOOKUP(Q15,'Product Information'!$A$2:$C$31,3))","v":""},{"$f":"IF(ISBLANK('Customer Input'!O15),\"\",'Customer Input'!O15)","v":""},{"$f":"IF(ISBLANK('Customer Input'!O15),\"\",VLOOKUP(S15,'Product Information'!$A$2:$C$31,3))","v":""},{"$f":"IF(ISBLANK('Customer Input'!P15),\"\",'Customer Input'!P15)","v":""},{"$f":"IF(ISBLANK('Customer Input'!P15),\"\",VLOOKUP(U15,'Product Information'!$A$2:$C$31,3))","v":""},{"$f":"IF(ISBLANK('Customer Input'!Q15),\"\",'Customer Input'!Q15)","v":""},{"$f":"IF(ISBLANK('Customer Input'!Q15),\"\",VLOOKUP(W15,'Product Information'!$A$2:$C$31,3))","v":""},{"$f":"IF(ISBLANK('Customer Input'!R15),\"\",'Customer Input'!R15)","v":""},{"$f":"IF(ISBLANK('Customer Input'!R15),\"\",VLOOKUP(Y15,'Product Information'!$A$2:$C$31,3))","v":""},{"$f":"IF(ISBLANK('Customer Input'!S15),\"\",'Customer Input'!S15)","v":""},{"$f":"IF(ISBLANK('Customer Input'!S15),\"\",VLOOKUP(AA15,'Product Information'!$A$2:$C$31,3))","v":""},1,12.99,0,{"$f":"IF(MATCH(B15,'Order History'!V:V,0)=MAX('Order History'!A:A)-A15+2,0,IF(VLOOKUP(MATCH(B15,'Order History'!V:V,0)-1,'Order History'!$T$2:$AJ$11,17)>199,_xlfn.FLOOR.MATH(AD15*10)/100,0))","v":0},12.99,1.2990000000000002,1.1200000000000001,15.408999999999999,null,null,null,"ID",6.0299999999999999E-2]
[{"$f":"IF(ISBLANK('Customer Input'!D16),\"\",ROW()+999)","v":1015},{"$f":"'Customer Input'!D16","v":6315790090},{"$f":"CONCATENATE('Customer Input'!C16,\" \",'Customer Input'!B16)","v":"Caputo Matthew"},{"$f":"'Customer Input'!A16","v":"2021-10-27"},{"$f":"'Customer Input'!H16","v":"TX"},{"$f":"VLOOKUP(B16,'Customer Information'!$A$2:$I$17,8)","v":2007},{"$f":"IF('Customer Input'!F16=VLOOKUP('Input Calculation'!B16,'Customer Information'!$A$2:$I$17,4),\"No\",\"Yes\")","v":"No"},{"$f":"IF(VLOOKUP(B16,'Customer Information'!$A$2:$I$17,9)=\"Yes\",\"\",\"Attn: Manager\")","v":""},{"$f":"IF(ISBLANK('Customer Input'!J16),\"\",'Customer Input'!J16)","v":5216388},{"$f":"IF(ISBLANK('Customer Input'!J16),\"\",VLOOKUP(I16,'Product Information'!$A$2:$C$31,3))","v":49.99},{"$f":"IF(ISBLANK('Customer Input'!K16),\"\",'Customer Input'!K16)","v":""},{"$f":"IF(ISBLANK('Customer Input'!K16),\"\",VLOOKUP(K16,'Product Information'!$A$2:$C$31,3))","v":""},{"$f":"IF(ISBLANK('Customer Input'!L16),\"\",'Customer Input'!L16)","v":""},{"$f":"IF(ISBLANK('Customer Input'!L16),\"\",VLOOKUP(M16,'Product Information'!$A$2:$C$31,3))","v":""},{"$f":"IF(ISBLANK('Customer Input'!M16),\"\",'Customer Input'!M16)","v":""},{"$f":"IF(ISBLANK('Customer Input'!M16),\"\",VLOOKUP(O16,'Product Information'!$A$2:$C$31,3))","v":""},{"$f":"IF(ISBLANK('Customer Input'!N16),\"\",'Customer Input'!N16)","v":""},{"$f":"IF(ISBLANK('Customer Input'!N16),\"\",VLOOKUP(Q16,'Product Information'!$A$2:$C$31,3))","v":""},{"$f":"IF(ISBLANK('Customer Input'!O16),\"\",'Customer Input'!O16)","v":""},{"$f":"IF(ISBLANK('Customer Input'!O16),\"\",VLOOKUP(S16,'Product Information'!$A$2:$C$31,3))","v":""},{"$f":"IF(ISBLANK('Customer Input'!P16),\"\",'Customer Input'!P16)","v":""},{"$f":"IF(ISBLANK('Customer Input'!P16),\"\",VLOOKUP(U16,'Product Information'!$A$2:$C$31,3))","v":""},{"$f":"IF(ISBLANK('Customer Input'!Q16),\"\",'Customer Input'!Q16)","v":""},{"$f":"IF(ISBLANK('Customer Input'!Q16),\"\",VLOOKUP(W16,'Product Information'!$A$2:$C$31,3))","v":""},{"$f":"IF(ISBLANK('Customer Input'!R16),\"\",'Customer Input'!R16)","v":""},{"$f":"IF(ISBLANK('Customer Input'!R16),\"\",VLOOKUP(Y16,'Product Information'!$A$2:$C$31,3))","v":""},{"$f":"IF(ISBLANK('Customer Input'!S16),\"\",'Customer Input'!S16)","v":""},{"$f":"IF(ISBLANK('Customer Input'!S16),\"\",VLOOKUP(AA16,'Product Information'!$A$2:$C$31,3))","v":""},1,49.99,4.99,{"$f":"IF(MATCH(B16,'Order History'!V:V,0)=MAX('Order History'!A:A)-A16+2,0,IF(VLOOKUP(MATCH(B16,'Order History'!V:V,0)-1,'Order History'!$T$2:$AJ$11,17)>199,_xlfn.FLOOR.MATH(AD16*10)/100,0))","v":0},45,0,3.68,48.68,null,null,null,"IL",9.0800000000000006E-2]
[{"$f":"IF(ISBLANK('Customer Input'!D17),\"\",ROW()+999)","v":1016},{"$f":"'Customer Input'!D17","v":3056223185},{"$f":"CONCATENATE('Customer Input'!C17,\" \",'Customer Input'!B17)","v":"Rhythm DJ"},{"$f":"'Customer Input'!A17","v":"2021-10-28"},{"$f":"'Customer Input'!H17","v":"FL"},{"$f":"VLOOKUP(B17,'Customer Information'!$A$2:$I$17,8)","v":2007},{"$f":"IF('Customer Input'!F17=VLOOKUP('Input Calculation'!B17,'Customer Information'!$A$2:$I$17,4),\"No\",\"Yes\")","v":"Yes"},{"$f":"IF(VLOOKUP(B17,'Customer Information'!$A$2:$I$17,9)=\"Yes\",\"\",\"Attn: Manager\")","v":"Attn: Manager"},{"$f":"IF(ISBLANK('Customer Input'!J17),\"\",'Customer Input'!J17)","v":4989600},{"$f":"IF(ISBLANK('Customer Input'!J17),\"\",VLOOKUP(I17,'Product Information'!$A$2:$C$31,3))","v":29.99},{"$f":"IF(ISBLANK('Customer Input'!K17),\"\",'Customer Input'!K17)","v":3055845},{"$f":"IF(ISBLANK('Customer Input'!K17),\"\",VLOOKUP(K17,'Product Information'!$A$2:$C$31,3))","v":199.99},{"$f":"IF(ISBLANK('Customer Input'!L17),\"\",'Customer Input'!L17)","v":""},{"$f":"IF(ISBLANK('Customer Input'!L17),\"\",VLOOKUP(M17,'Product Information'!$A$2:$C$31,3))","v":""},{"$f":"IF(ISBLANK('Customer Input'!M17),\"\",'Customer Input'!M17)","v":""},{"$f":"IF(ISBLANK('Customer Input'!M17),\"\",VLOOKUP(O17,'Product Information'!$A$2:$C$31,3))","v":""},{"$f":"IF(ISBLANK('Customer Input'!N17),\"\",'Customer Input'!N17)","v":""},{"$f":"IF(ISBLANK('Customer Input'!N17),\"\",VLOOKUP(Q17,'Product Information'!$A$2:$C$31,3))","v":""},{"$f":"IF(ISBLANK('Customer Input'!O17),\"\",'Customer Input'!O17)","v":""},{"$f":"IF(ISBLANK('Customer Input'!O17),\"\",VLOOKUP(S17,'Product Information'!$A$2:$C$31,3))","v":""},{"$f":"IF(ISBLANK('Customer Input'!P17),\"\",'Customer Input'!P17)","v":""},{"$f":"IF(ISBLANK('Customer Input'!P17),\"\",VLOOKUP(U17,'Product Information'!$A$2:$C$31,3))","v":""},{"$f":"IF(ISBLANK('Customer Input'!Q17),\"\",'Customer Input'!Q17)","v":""},{"$f":"IF(ISBLANK('Customer Input'!Q17),\"\",VLOOKUP(W17,'Product Information'!$A$2:$C$31,3))","v":""},{"$f":"IF(ISBLANK('Customer Input'!R17),\"\",'Customer Input'!R17)","v":""},{"$f":"IF(ISBLANK('Customer Input'!R17),\"\",VLOOKUP(Y17,'Product Information'!$A$2:$C$31,3))","v":""},{"$f":"IF(ISBLANK('Customer Input'!S17),\"\",'Customer Input'!S17)","v":""},{"$f":"IF(ISBLANK('Customer Input'!S17),\"\",VLOOKUP(AA17,'Product Information'!$A$2:$C$31,3))","v":""},2,229.98000000000002,22.99,{"$f":"IF(MATCH(B17,'Order History'!V:V,0)=MAX('Order History'!A:A)-A17+2,0,IF(VLOOKUP(MATCH(B17,'Order History'!V:V,0)-1,'Order History'!$T$2:$AJ$11,17)>199,_xlfn.FLOOR.MATH(AD17*10)/100,0))","v":0},206.99,0,14.59,221.58,null,null,null,"IN",7.0000000000000007E-2]
[{"$f":"IF(ISBLANK('Customer Input'!D18),\"\",ROW()+999)","v":1017},{"$f":"'Customer Input'!D18","v":9184329830},{"$f":"CONCATENATE('Customer Input'!C18,\" \",'Customer Input'!B18)","v":"Jane Mary"},{"$f":"'Customer Input'!A18","v":"2021-10-28"},{"$f":"'Customer Input'!H18","v":"CO"},{"$f":"VLOOKUP(B18,'Customer Information'!$A$2:$I$17,8)","v":2001},{"$f":"IF('Customer Input'!F18=VLOOKUP('Input Calculation'!B18,'Customer Information'!$A$2:$I$17,4),\"No\",\"Yes\")","v":"No"},{"$f":"IF(VLOOKUP(B18,'Customer Information'!$A$2:$I$17,9)=\"Yes\",\"\",\"Attn: Manager\")","v":"Attn: Manager"},{"$f":"IF(ISBLANK('Customer Input'!J18),\"\",'Customer Input'!J18)","v":3055845},{"$f":"IF(ISBLANK('Customer Input'!J18),\"\",VLOOKUP(I18,'Product Information'!$A$2:$C$31,3))","v":199.99},{"$f":"IF(ISBLANK('Customer Input'!K18),\"\",'Customer Input'!K18)","v":""},{"$f":"IF(ISBLANK('Customer Input'!K18),\"\",VLOOKUP(K18,'Product Information'!$A$2:$C$31,3))","v":""},{"$f":"IF(ISBLANK('Customer Input'!L18),\"\",'Customer Input'!L18)","v":""},{"$f":"IF(ISBLANK('Customer Input'!L18),\"\",VLOOKUP(M18,'Product Information'!$A$2:$C$31,3))","v":""},{"$f":"IF(ISBLANK('Customer Input'!M18),\"\",'Customer Input'!M18)","v":""},{"$f":"IF(ISBLANK('Customer Input'!M18),\"\",VLOOKUP(O18,'Product Information'!$A$2:$C$31,3))","v":""},{"$f":"IF(ISBLANK('Customer Input'!N18),\"\",'Customer Input'!N18)","v":""},{"$f":"IF(ISBLANK('Customer Input'!N18),\"\",VLOOKUP(Q18,'Product Information'!$A$2:$C$31,3))","v":""},{"$f":"IF(ISBLANK('Customer Input'!O18),\"\",'Customer Input'!O18)","v":""},{"$f":"IF(ISBLANK('Customer Input'!O18),\"\",VLOOKUP(S18,'Product Information'!$A$2:$C$31,3))","v":""},{"$f":"IF(ISBLANK('Customer Input'!P18),\"\",'Customer Input'!P18)","v":""},{"$f":"IF(ISBLANK('Customer Input'!P18),\"\",VLOOKUP(U18,'Product Information'!$A$2:$C$31,3))","v":""},{"$f":"IF(ISBLANK('Customer Input'!Q18),\"\",'Customer Input'!Q18)","v":""},{"$f":"IF(ISBLANK('Customer Input'!Q18),\"\",VLOOKUP(W18,'Product Information'!$A$2:$C$31,3))","v":""},{"$f":"IF(ISBLANK('Customer Input'!R18),\"\",'Customer Input'!R18)","v":""},{"$f":"IF(ISBLANK('Customer Input'!R18),\"\",VLOOKUP(Y18,'Product Information'!$A$2:$C$31,3))","v":""},{"$f":"IF(ISBLANK('Customer Input'!S18),\"\",'Customer Input'!S18)","v":""},{"$f":"IF(ISBLANK('Customer Input'!S18),\"\",VLOOKUP(AA18,'Product Information'!$A$2:$C$31,3))","v":""},1,199.99,19.989999999999998,{"$f":"IF(MATCH(B18,'Order History'!V:V,0)=MAX('Order History'!A:A)-A18+2,0,IF(VLOOKUP(MATCH(B18,'Order History'!V:V,0)-1,'Order History'!$T$2:$AJ$11,17)>199,_xlfn.FLOOR.MATH(AD18*10)/100,0))","v":0},180,0,13.77,193.77,null,null,null,"KS",8.6800000000000002E-2]
[{"$f":"IF(ISBLANK('Customer Input'!D19),\"\",ROW()+999)","v":1018},{"$f":"'Customer Input'!D19","v":8785546312},{"$f":"CONCATENATE('Customer Input'!C19,\" \",'Customer Input'!B19)","v":"O'Lantern Jack"},{"$f":"'Customer Input'!A19","v":"2021-10-28"},{"$f":"'Customer Input'!H19","v":"MO"},{"$f":"VLOOKUP(B19,'Customer Information'!$A$2:$I$17,8)","v":2017},{"$f":"IF('Customer Input'!F19=VLOOKUP('Input Calculation'!B19,'Customer Information'!$A$2:$I$17,4),\"No\",\"Yes\")","v":"No"},{"$f":"IF(VLOOKUP(B19,'Customer Information'!$A$2:$I$17,9)=\"Yes\",\"\",\"Attn: Manager\")","v":"Attn: Manager"},{"$f":"IF(ISBLANK('Customer Input'!J19),\"\",'Customer Input'!J19)","v":3055845},{"$f":"IF(ISBLANK('Customer Input'!J19),\"\",VLOOKUP(I19,'Product Information'!$A$2:$C$31,3))","v":199.99},{"$f":"IF(ISBLANK('Customer Input'!K19),\"\",'Customer Input'!K19)","v":""},{"$f":"IF(ISBLANK('Customer Input'!K19),\"\",VLOOKUP(K19,'Product Information'!$A$2:$C$31,3))","v":""},{"$f":"IF(ISBLANK('Customer Input'!L19),\"\",'Customer Input'!L19)","v":""},{"$f":"IF(ISBLANK('Customer Input'!L19),\"\",VLOOKUP(M19,'Product Information'!$A$2:$C$31,3))","v":""},{"$f":"IF(ISBLANK('Customer Input'!M19),\"\",'Customer Input'!M19)","v":""},{"$f":"IF(ISBLANK('Customer Input'!M19),\"\",VLOOKUP(O19,'Product Information'!$A$2:$C$31,3))","v":""},{"$f":"IF(ISBLANK('Customer Input'!N19),\"\",'Customer Input'!N19)","v":""},{"$f":"IF(ISBLANK('Customer Input'!N19),\"\",VLOOKUP(Q19,'Product Information'!$A$2:$C$31,3))","v":""},{"$f":"IF(ISBLANK('Customer Input'!O19),\"\",'Customer Input'!O19)","v":""},{"$f":"IF(ISBLANK('Customer Input'!O19),\"\",VLOOKUP(S19,'Product Information'!$A$2:$C$31,3))","v":""},{"$f":"IF(ISBLANK('Customer Input'!P19),\"\",'Customer Input'!P19)","v":""},{"$f":"IF(ISBLANK('Customer Input'!P19),\"\",VLOOKUP(U19,'Product Information'!$A$2:$C$31,3))","v":""},{"$f":"IF(ISBLANK('Customer Input'!Q19),\"\",'Customer Input'!Q19)","v":""},{"$f":"IF(ISBLANK('Customer Input'!Q19),\"\",VLOOKUP(W19,'Product Information'!$A$2:$C$31,3))","v":""},{"$f":"IF(ISBLANK('Customer Input'!R19),\"\",'Customer Input'!R19)","v":""},{"$f":"IF(ISBLANK('Customer Input'!R19),\"\",VLOOKUP(Y19,'Product Information'!$A$2:$C$31,3))","v":""},{"$f":"IF(ISBLANK('Customer Input'!S19),\"\",'Customer Input'!S19)","v":""},{"$f":"IF(ISBLANK('Customer Input'!S19),\"\",VLOOKUP(AA19,'Product Information'!$A$2:$C$31,3))","v":""},1,199.99,0,{"$f":"IF(MATCH(B19,'Order History'!V:V,0)=MAX('Order History'!A:A)-A19+2,0,IF(VLOOKUP(MATCH(B19,'Order History'!V:V,0)-1,'Order History'!$T$2:$AJ$11,17)>199,_xlfn.FLOOR.MATH(AD19*10)/100,0))","v":19.989999999999998},180,0,14.72,194.72,null,null,null,"KY",0.06]
[{"$f":"IF(ISBLANK('Customer Input'!D20),\"\",ROW()+999)","v":1019},{"$f":"'Customer Input'!D20","v":9224318825},{"$f":"CONCATENATE('Customer Input'!C20,\" \",'Customer Input'!B20)","v":"N'Charge Charles"},{"$f":"'Customer Input'!A20","v":"2021-10-28"},{"$f":"'Customer Input'!H20","v":"WA"},{"$f":"VLOOKUP(B20,'Customer Information'!$A$2:$I$17,8)","v":2015},{"$f":"IF('Customer Input'!F20=VLOOKUP('Input Calculation'!B20,'Customer Information'!$A$2:$I$17,4),\"No\",\"Yes\")","v":"Yes"},{"$f":"IF(VLOOKUP(B20,'Customer Information'!$A$2:$I$17,9)=\"Yes\",\"\",\"Attn: Manager\")","v":""},{"$f":"IF(ISBLANK('Customer Input'!J20),\"\",'Customer Input'!J20)","v":8924251},{"$f":"IF(ISBLANK('Customer Input'!J20),\"\",VLOOKUP(I20,'Product Information'!$A$2:$C$31,3))","v":99.99},{"$f":"IF(ISBLANK('Customer Input'!K20),\"\",'Customer Input'!K20)","v":5216388},{"$f":"IF(ISBLANK('Customer Input'!K20),\"\",VLOOKUP(K20,'Product Information'!$A$2:$C$31,3))","v":49.99},{"$f":"IF(ISBLANK('Customer Input'!L20),\"\",'Customer Input'!L20)","v":""},{"$f":"IF(ISBLANK('Customer Input'!L20),\"\",VLOOKUP(M20,'Product Information'!$A$2:$C$31,3))","v":""},{"$f":"IF(ISBLANK('Customer Input'!M20),\"\",'Customer Input'!M20)","v":""},{"$f":"IF(ISBLANK('Customer Input'!M20),\"\",VLOOKUP(O20,'Product Information'!$A$2:$C$31,3))","v":""},{"$f":"IF(ISBLANK('Customer Input'!N20),\"\",'Customer Input'!N20)","v":""},{"$f":"IF(ISBLANK('Customer Input'!N20),\"\",VLOOKUP(Q20,'Product Information'!$A$2:$C$31,3))","v":""},{"$f":"IF(ISBLANK('Customer Input'!O20),\"\",'Customer Input'!O20)","v":""},{"$f":"IF(ISBLANK('Customer Input'!O20),\"\",VLOOKUP(S20,'Product Information'!$A$2:$C$31,3))","v":""},{"$f":"IF(ISBLANK('Customer Input'!P20),\"\",'Customer Input'!P20)","v":""},{"$f":"IF(ISBLANK('Customer Input'!P20),\"\",VLOOKUP(U20,'Product Information'!$A$2:$C$31,3))","v":""},{"$f":"IF(ISBLANK('Customer Input'!Q20),\"\",'Customer Input'!Q20)","v":""},{"$f":"IF(ISBLANK('Customer Input'!Q20),\"\",VLOOKUP(W20,'Product Information'!$A$2:$C$31,3))","v":""},{"$f":"IF(ISBLANK('Customer Input'!R20),\"\",'Customer Input'!R20)","v":""},{"$f":"IF(ISBLANK('Customer Input'!R20),\"\",VLOOKUP(Y20,'Product Information'!$A$2:$C$31,3))","v":""},{"$f":"IF(ISBLANK('Customer Input'!S20),\"\",'Customer Input'!S20)","v":""},{"$f":"IF(ISBLANK('Customer Input'!S20),\"\",VLOOKUP(AA20,'Product Information'!$A$2:$C$31,3))","v":""},2,149.97999999999999,0,{"$f":"IF(MATCH(B20,'Order History'!V:V,0)=MAX('Order History'!A:A)-A20+2,0,IF(VLOOKUP(MATCH(B20,'Order History'!V:V,0)-1,'Order History'!$T$2:$AJ$11,17)>199,_xlfn.FLOOR.MATH(AD20*10)/100,0))","v":0},149.97999999999999,5,13.81,168.79,null,null,null,"LA",9.5200000000000007E-2]
[{"$f":"IF(ISBLANK('Customer Input'!D21),\"\",ROW()+999)","v":1020},{"$f":"'Customer Input'!D21","v":6315790090},{"$f":"CONCATENATE('Customer Input'!C21,\" \",'Customer Input'!B21)","v":"Caputo Matthew"},{"$f":"'Customer Input'!A21","v":"2021-10-29"},{"$f":"'Customer Input'!H21","v":"TX"},{"$f":"VLOOKUP(B21,'Customer Information'!$A$2:$I$17,8)","v":2007},{"$f":"IF('Customer Input'!F21=VLOOKUP('Input Calculation'!B21,'Customer Information'!$A$2:$I$17,4),\"No\",\"Yes\")","v":"No"},{"$f":"IF(VLOOKUP(B21,'Customer Information'!$A$2:$I$17,9)=\"Yes\",\"\",\"Attn: Manager\")","v":""},{"$f":"IF(ISBLANK('Customer Input'!J21),\"\",'Customer Input'!J21)","v":8924251},{"$f":"IF(ISBLANK('Customer Input'!J21),\"\",VLOOKUP(I21,'Product Information'!$A$2:$C$31,3))","v":99.99},{"$f":"IF(ISBLANK('Customer Input'!K21),\"\",'Customer Input'!K21)","v":5216388},{"$f":"IF(ISBLANK('Customer Input'!K21),\"\",VLOOKUP(K21,'Product Information'!$A$2:$C$31,3))","v":49.99},{"$f":"IF(ISBLANK('Customer Input'!L21),\"\",'Customer Input'!L21)","v":""},{"$f":"IF(ISBLANK('Customer Input'!L21),\"\",VLOOKUP(M21,'Product Information'!$A$2:$C$31,3))","v":""},{"$f":"IF(ISBLANK('Customer Input'!M21),\"\",'Customer Input'!M21)","v":""},{"$f":"IF(ISBLANK('Customer Input'!M21),\"\",VLOOKUP(O21,'Product Information'!$A$2:$C$31,3))","v":""},{"$f":"IF(ISBLANK('Customer Input'!N21),\"\",'Customer Input'!N21)","v":""},{"$f":"IF(ISBLANK('Customer Input'!N21),\"\",VLOOKUP(Q21,'Product Information'!$A$2:$C$31,3))","v":""},{"$f":"IF(ISBLANK('Customer Input'!O21),\"\",'Customer Input'!O21)","v":""},{"$f":"IF(ISBLANK('Customer Input'!O21),\"\",VLOOKUP(S21,'Product Information'!$A$2:$C$31,3))","v":""},{"$f":"IF(ISBLANK('Customer Input'!P21),\"\",'Customer Input'!P21)","v":""},{"$f":"IF(ISBLANK('Customer Input'!P21),\"\",VLOOKUP(U21,'Product Information'!$A$2:$C$31,3))","v":""},{"$f":"IF(ISBLANK('Customer Input'!Q21),\"\",'Customer Input'!Q21)","v":""},{"$f":"IF(ISBLANK('Customer Input'!Q21),\"\",VLOOKUP(W21,'Product Information'!$A$2:$C$31,3))","v":""},{"$f":"IF(ISBLANK('Customer Input'!R21),\"\",'Customer Input'!R21)","v":""},{"$f":"IF(ISBLANK('Customer Input'!R21),\"\",VLOOKUP(Y21,'Product Information'!$A$2:$C$31,3))","v":""},{"$f":"IF(ISBLANK('Customer Input'!S21),\"\",'Customer Input'!S21)","v":""},{"$f":"IF(ISBLANK('Customer Input'!S21),\"\",VLOOKUP(AA21,'Product Information'!$A$2:$C$31,3))","v":""},2,149.97999999999999,14.99,{"$f":"IF(MATCH(B21,'Order History'!V:V,0)=MAX('Order History'!A:A)-A21+2,0,IF(VLOOKUP(MATCH(B21,'Order History'!V:V,0)-1,'Order History'!$T$2:$AJ$11,17)>199,_xlfn.FLOOR.MATH(AD21*10)/100,0))","v":0},134.98999999999998,0,11.05,146.04,null,null,null,"MA",6.25E-2]
[{"$f":"IF(ISBLANK('Customer Input'!D22),\"\",ROW()+999)","v":1021},{"$f":"'Customer Input'!D22","v":8174368834},{"$f":"CONCATENATE('Customer Input'!C22,\" \",'Customer Input'!B22)","v":"Doe John"},{"$f":"'Customer Input'!A22","v":"2021-10-29"},{"$f":"'Customer Input'!H22","v":"CA"},{"$f":"VLOOKUP(B22,'Customer Information'!$A$2:$I$17,8)","v":2017},{"$f":"IF('Customer Input'!F22=VLOOKUP('Input Calculation'!B22,'Customer Information'!$A$2:$I$17,4),\"No\",\"Yes\")","v":"No"},{"$f":"IF(VLOOKUP(B22,'Customer Information'!$A$2:$I$17,9)=\"Yes\",\"\",\"Attn: Manager\")","v":""},{"$f":"IF(ISBLANK('Customer Input'!J22),\"\",'Customer Input'!J22)","v":5216388},{"$f":"IF(ISBLANK('Customer Input'!J22),\"\",VLOOKUP(I22,'Product Information'!$A$2:$C$31,3))","v":49.99},{"$f":"IF(ISBLANK('Customer Input'!K22),\"\",'Customer Input'!K22)","v":""},{"$f":"IF(ISBLANK('Customer Input'!K22),\"\",VLOOKUP(K22,'Product Information'!$A$2:$C$31,3))","v":""},{"$f":"IF(ISBLANK('Customer Input'!L22),\"\",'Customer Input'!L22)","v":""},{"$f":"IF(ISBLANK('Customer Input'!L22),\"\",VLOOKUP(M22,'Product Information'!$A$2:$C$31,3))","v":""},{"$f":"IF(ISBLANK('Customer Input'!M22),\"\",'Customer Input'!M22)","v":""},{"$f":"IF(ISBLANK('Customer Input'!M22),\"\",VLOOKUP(O22,'Product Information'!$A$2:$C$31,3))","v":""},{"$f":"IF(ISBLANK('Customer Input'!N22),\"\",'Customer Input'!N22)","v":""},{"$f":"IF(ISBLANK('Customer Input'!N22),\"\",VLOOKUP(Q22,'Product Information'!$A$2:$C$31,3))","v":""},{"$f":"IF(ISBLANK('Customer Input'!O22),\"\",'Customer Input'!O22)","v":""},{"$f":"IF(ISBLANK('Customer Input'!O22),\"\",VLOOKUP(S22,'Product Information'!$A$2:$C$31,3))","v":""},{"$f":"IF(ISBLANK('Customer Input'!P22),\"\",'Customer Input'!P22)","v":""},{"$f":"IF(ISBLANK('Customer Input'!P22),\"\",VLOOKUP(U22,'Product Information'!$A$2:$C$31,3))","v":""},{"$f":"IF(ISBLANK('Customer Input'!Q22),\"\",'Customer Input'!Q22)","v":""},{"$f":"IF(ISBLANK('Customer Input'!Q22),\"\",VLOOKUP(W22,'Product Information'!$A$2:$C$31,3))","v":""},{"$f":"IF(ISBLANK('Customer Input'!R22),\"\",'Customer Input'!R22)","v":""},{"$f":"IF(ISBLANK('Customer Input'!R22),\"\",VLOOKUP(Y22,'Product Information'!$A$2:$C$31,3))","v":""},{"$f":"IF(ISBLANK('Customer Input'!S22),\"\",'Customer Input'!S22)","v":""},{"$f":"IF(ISBLANK('Customer Input'!S22),\"\",VLOOKUP(AA22,'Product Information'!$A$2:$C$31,3))","v":""},1,49.99,0,{"$f":"IF(MATCH(B22,'Order History'!V:V,0)=MAX('Order History'!A:A)-A22+2,0,IF(VLOOKUP(MATCH(B22,'Order History'!V:V,0)-1,'Order History'!$T$2:$AJ$11,17)>199,_xlfn.FLOOR.MATH(AD22*10)/100,0))","v":0},49.99,4.9990000000000006,4.32,59.309000000000005,null,null,null,"MD",0.06]
[{"$f":"IF(ISBLANK('Customer Input'!D23),\"\",ROW()+999)","v":1022},{"$f":"'Customer Input'!D23","v":6530353532},{"$f":"CONCATENATE('Customer Input'!C23,\" \",'Customer Input'!B23)","v":"Pumpkineater Peter"},{"$f":"'Customer Input'!A23","v":"2021-10-29"},{"$f":"'Customer Input'!H23","v":"VT"},{"$f":"VLOOKUP(B23,'Customer Information'!$A$2:$I$17,8)","v":2008},{"$f":"IF('Customer Input'!F23=VLOOKUP('Input Calculation'!B23,'Customer Information'!$A$2:$I$17,4),\"No\",\"Yes\")","v":"No"},{"$f":"IF(VLOOKUP(B23,'Customer Information'!$A$2:$I$17,9)=\"Yes\",\"\",\"Attn: Manager\")","v":""},{"$f":"IF(ISBLANK('Customer Input'!J23),\"\",'Customer Input'!J23)","v":8924251},{"$f":"IF(ISBLANK('Customer Input'!J23),\"\",VLOOKUP(I23,'Product Information'!$A$2:$C$31,3))","v":99.99},{"$f":"IF(ISBLANK('Customer Input'!K23),\"\",'Customer Input'!K23)","v":""},{"$f":"IF(ISBLANK('Customer Input'!K23),\"\",VLOOKUP(K23,'Product Information'!$A$2:$C$31,3))","v":""},{"$f":"IF(ISBLANK('Customer Input'!L23),\"\",'Customer Input'!L23)","v":""},{"$f":"IF(ISBLANK('Customer Input'!L23),\"\",VLOOKUP(M23,'Product Information'!$A$2:$C$31,3))","v":""},{"$f":"IF(ISBLANK('Customer Input'!M23),\"\",'Customer Input'!M23)","v":""},{"$f":"IF(ISBLANK('Customer Input'!M23),\"\",VLOOKUP(O23,'Product Information'!$A$2:$C$31,3))","v":""},{"$f":"IF(ISBLANK('Customer Input'!N23),\"\",'Customer Input'!N23)","v":""},{"$f":"IF(ISBLANK('Customer Input'!N23),\"\",VLOOKUP(Q23,'Product Information'!$A$2:$C$31,3))","v":""},{"$f":"IF(ISBLANK('Customer Input'!O23),\"\",'Customer Input'!O23)","v":""},{"$f":"IF(ISBLANK('Customer Input'!O23),\"\",VLOOKUP(S23,'Product Information'!$A$2:$C$31,3))","v":""},{"$f":"IF(ISBLANK('Customer Input'!P23),\"\",'Customer Input'!P23)","v":""},{"$f":"IF(ISBLANK('Customer Input'!P23),\"\",VLOOKUP(U23,'Product Information'!$A$2:$C$31,3))","v":""},{"$f":"IF(ISBLANK('Customer Input'!Q23),\"\",'Customer Input'!Q23)","v":""},{"$f":"IF(ISBLANK('Customer Input'!Q23),\"\",VLOOKUP(W23,'Product Information'!$A$2:$C$31,3))","v":""},{"$f":"IF(ISBLANK('Customer Input'!R23),\"\",'Customer Input'!R23)","v":""},{"$f":"IF(ISBLANK('Customer Input'!R23),\"\",VLOOKUP(Y23,'Product Information'!$A$2:$C$31,3))","v":""},{"$f":"IF(ISBLANK('Customer Input'!S23),\"\",'Customer Input'!S23)","v":""},{"$f":"IF(ISBLANK('Customer Input'!S23),\"\",VLOOKUP(AA23,'Product Information'!$A$2:$C$31,3))","v":""},1,99.99,9.99,{"$f":"IF(MATCH(B23,'Order History'!V:V,0)=MAX('Order History'!A:A)-A23+2,0,IF(VLOOKUP(MATCH(B23,'Order History'!V:V,0)-1,'Order History'!$T$2:$AJ$11,17)>199,_xlfn.FLOOR.MATH(AD23*10)/100,0))","v":0},90,0,5.59,95.59,null,null,null,"ME",5.5E-2]
[{"$f":"IF(ISBLANK('Customer Input'!D24),\"\",ROW()+999)","v":1023},{"$f":"'Customer Input'!D24","v":6315790090},{"$f":"CONCATENATE('Customer Input'!C24,\" \",'Customer Input'!B24)","v":"Caputo Matthew"},{"$f":"'Customer Input'!A24","v":"2021-10-29"},{"$f":"'Customer Input'!H24","v":"TX"},{"$f":"VLOOKUP(B24,'Customer Information'!$A$2:$I$17,8)","v":2007},{"$f":"IF('Customer Input'!F24=VLOOKUP('Input Calculation'!B24,'Customer Information'!$A$2:$I$17,4),\"No\",\"Yes\")","v":"No"},{"$f":"IF(VLOOKUP(B24,'Customer Information'!$A$2:$I$17,9)=\"Yes\",\"\",\"Attn: Manager\")","v":""},{"$f":"IF(ISBLANK('Customer Input'!J24),\"\",'Customer Input'!J24)","v":7250412},{"$f":"IF(ISBLANK('Customer Input'!J24),\"\",VLOOKUP(I24,'Product Information'!$A$2:$C$31,3))","v":12.99},{"$f":"IF(ISBLANK('Customer Input'!K24),\"\",'Customer Input'!K24)","v":8924251},{"$f":"IF(ISBLANK('Customer Input'!K24),\"\",VLOOKUP(K24,'Product Information'!$A$2:$C$31,3))","v":99.99},{"$f":"IF(ISBLANK('Customer Input'!L24),\"\",'Customer Input'!L24)","v":""},{"$f":"IF(ISBLANK('Customer Input'!L24),\"\",VLOOKUP(M24,'Product Information'!$A$2:$C$31,3))","v":""},{"$f":"IF(ISBLANK('Customer Input'!M24),\"\",'Customer Input'!M24)","v":""},{"$f":"IF(ISBLANK('Customer Input'!M24),\"\",VLOOKUP(O24,'Product Information'!$A$2:$C$31,3))","v":""},{"$f":"IF(ISBLANK('Customer Input'!N24),\"\",'Customer Input'!N24)","v":""},{"$f":"IF(ISBLANK('Customer Input'!N24),\"\",VLOOKUP(Q24,'Product Information'!$A$2:$C$31,3))","v":""},{"$f":"IF(ISBLANK('Customer Input'!O24),\"\",'Customer Input'!O24)","v":""},{"$f":"IF(ISBLANK('Customer Input'!O24),\"\",VLOOKUP(S24,'Product Information'!$A$2:$C$31,3))","v":""},{"$f":"IF(ISBLANK('Customer Input'!P24),\"\",'Customer Input'!P24)","v":""},{"$f":"IF(ISBLANK('Customer Input'!P24),\"\",VLOOKUP(U24,'Product Information'!$A$2:$C$31,3))","v":""},{"$f":"IF(ISBLANK('Customer Input'!Q24),\"\",'Customer Input'!Q24)","v":""},{"$f":"IF(ISBLANK('Customer Input'!Q24),\"\",VLOOKUP(W24,'Product Information'!$A$2:$C$31,3))","v":""},{"$f":"IF(ISBLANK('Customer Input'!R24),\"\",'Customer Input'!R24)","v":""},{"$f":"IF(ISBLANK('Customer Input'!R24),\"\",VLOOKUP(Y24,'Product Information'!$A$2:$C$31,3))","v":""},{"$f":"IF(ISBLANK('Customer Input'!S24),\"\",'Customer Input'!S24)","v":""},{"$f":"IF(ISBLANK('Customer Input'!S24),\"\",VLOOKUP(AA24,'Product Information'!$A$2:$C$31,3))","v":""},2,112.97999999999999,11.29,{"$f":"IF(MATCH(B24,'Order History'!V:V,0)=MAX('Order History'!A:A)-A24+2,0,IF(VLOOKUP(MATCH(B24,'Order History'!V:V,0)-1,'Order History'!$T$2:$AJ$11,17)>199,_xlfn.FLOOR.MATH(AD24*10)/100,0))","v":0},101.69,0,8.32,110.00999999999999,null,null,null,"MI",0.06]
[{"$f":"IF(ISBLANK('Customer Input'!D25),\"\",ROW()+999)","v":1024},{"$f":"'Customer Input'!D25","v":9153230352},{"$f":"CONCATENATE('Customer Input'!C25,\" \",'Customer Input'!B25)","v":"Liberace Mister"},{"$f":"'Customer Input'!A25","v":"2021-10-30"},{"$f":"'Customer Input'!H25","v":"NV"},{"$f":"VLOOKUP(B25,'Customer Information'!$A$2:$I$17,8)","v":1985},{"$f":"IF('Customer Input'!F25=VLOOKUP('Input Calculation'!B25,'Customer Information'!$A$2:$I$17,4),\"No\",\"Yes\")","v":"No"},{"$f":"IF(VLOOKUP(B25,'Customer Information'!$A$2:$I$17,9)=\"Yes\",\"\",\"Attn: Manager\")","v":""},{"$f":"IF(ISBLANK('Customer Input'!J25),\"\",'Customer Input'!J25)","v":1252953},{"$f":"IF(ISBLANK('Customer Input'!J25),\"\",VLOOKUP(I25,'Product Information'!$A$2:$C$31,3))","v":54.99},{"$f":"IF(ISBLANK('Customer Input'!K25),\"\",'Customer Input'!K25)","v":1465559},{"$f":"IF(ISBLANK('Customer Input'!K25),\"\",VLOOKUP(K25,'Product Information'!$A$2:$C$31,3))","v":24.99},{"$f":"IF(ISBLANK('Customer Input'!L25),\"\",'Customer Input'!L25)","v":1983220},{"$f":"IF(ISBLANK('Customer Input'!L25),\"\",VLOOKUP(M25,'Product Information'!$A$2:$C$31,3))","v":34.99},{"$f":"IF(ISBLANK('Customer Input'!M25),\"\",'Customer Input'!M25)","v":2056772},{"$f":"IF(ISBLANK('Customer Input'!M25),\"\",VLOOKUP(O25,'Product Information'!$A$2:$C$31,3))","v":74.989999999999995},{"$f":"IF(ISBLANK('Customer Input'!N25),\"\",'Customer Input'!N25)","v":2847693},{"$f":"IF(ISBLANK('Customer Input'!N25),\"\",VLOOKUP(Q25,'Product Information'!$A$2:$C$31,3))","v":134.99},{"$f":"IF(ISBLANK('Customer Input'!O25),\"\",'Customer Input'!O25)","v":3055845},{"$f":"IF(ISBLANK('Customer Input'!O25),\"\",VLOOKUP(S25,'Product Information'!$A$2:$C$31,3))","v":199.99},{"$f":"IF(ISBLANK('Customer Input'!P25),\"\",'Customer Input'!P25)","v":3148653},{"$f":"IF(ISBLANK('Customer Input'!P25),\"\",VLOOKUP(U25,'Product Information'!$A$2:$C$31,3))","v":449.99},{"$f":"IF(ISBLANK('Customer Input'!Q25),\"\",'Customer Input'!Q25)","v":3785616},{"$f":"IF(ISBLANK('Customer Input'!Q25),\"\",VLOOKUP(W25,'Product Information'!$A$2:$C$31,3))","v":499.99},{"$f":"IF(ISBLANK('Customer Input'!R25),\"\",'Customer Input'!R25)","v":3818725},{"$f":"IF(ISBLANK('Customer Input'!R25),\"\",VLOOKUP(Y25,'Product Information'!$A$2:$C$31,3))","v":999.99},{"$f":"IF(ISBLANK('Customer Input'!S25),\"\",'Customer Input'!S25)","v":3832255},{"$f":"IF(ISBLANK('Customer Input'!S25),\"\",VLOOKUP(AA25,'Product Information'!$A$2:$C$31,3))","v":19.989999999999998},10,2494.8999999999996,249.49,{"$f":"IF(MATCH(B25,'Order History'!V:V,0)=MAX('Order History'!A:A)-A25+2,0,IF(VLOOKUP(MATCH(B25,'Order History'!V:V,0)-1,'Order History'!$T$2:$AJ$11,17)>199,_xlfn.FLOOR.MATH(AD25*10)/100,0))","v":0},2245.41,0,186.81,2432.2199999999998,null,null,null,"MN",7.46E-2]
[{"$f":"IF(ISBLANK('Customer Input'!D26),\"\",ROW()+999)","v":1025},{"$f":"'Customer Input'!D26","v":7139892245},{"$f":"CONCATENATE('Customer Input'!C26,\" \",'Customer Input'!B26)","v":"Kaploozie Suzie"},{"$f":"'Customer Input'!A26","v":"2021-10-30"},{"$f":"'Customer Input'!H26","v":"NY"},{"$f":"VLOOKUP(B26,'Customer Information'!$A$2:$I$17,8)","v":2003},{"$f":"IF('Customer Input'!F26=VLOOKUP('Input Calculation'!B26,'Customer Information'!$A$2:$I$17,4),\"No\",\"Yes\")","v":"No"},{"$f":"IF(VLOOKUP(B26,'Customer Information'!$A$2:$I$17,9)=\"Yes\",\"\",\"Attn: Manager\")","v":""},{"$f":"IF(ISBLANK('Customer Input'!J26),\"\",'Customer Input'!J26)","v":9242514},{"$f":"IF(ISBLANK('Customer Input'!J26),\"\",VLOOKUP(I26,'Product Information'!$A$2:$C$31,3))","v":499.99},{"$f":"IF(ISBLANK('Customer Input'!K26),\"\",'Customer Input'!K26)","v":5216388},{"$f":"IF(ISBLANK('Customer Input'!K26),\"\",VLOOKUP(K26,'Product Information'!$A$2:$C$31,3))","v":49.99},{"$f":"IF(ISBLANK('Customer Input'!L26),\"\",'Customer Input'!L26)","v":""},{"$f":"IF(ISBLANK('Customer Input'!L26),\"\",VLOOKUP(M26,'Product Information'!$A$2:$C$31,3))","v":""},{"$f":"IF(ISBLANK('Customer Input'!M26),\"\",'Customer Input'!M26)","v":""},{"$f":"IF(ISBLANK('Customer Input'!M26),\"\",VLOOKUP(O26,'Product Information'!$A$2:$C$31,3))","v":""},{"$f":"IF(ISBLANK('Customer Input'!N26),\"\",'Customer Input'!N26)","v":""},{"$f":"IF(ISBLANK('Customer Input'!N26),\"\",VLOOKUP(Q26,'Product Information'!$A$2:$C$31,3))","v":""},{"$f":"IF(ISBLANK('Customer Input'!O26),\"\",'Customer Input'!O26)","v":""},{"$f":"IF(ISBLANK('Customer Input'!O26),\"\",VLOOKUP(S26,'Product Information'!$A$2:$C$31,3))","v":""},{"$f":"IF(ISBLANK('Customer Input'!P26),\"\",'Customer Input'!P26)","v":""},{"$f":"IF(ISBLANK('Customer Input'!P26),\"\",VLOOKUP(U26,'Product Information'!$A$2:$C$31,3))","v":""},{"$f":"IF(ISBLANK('Customer Input'!Q26),\"\",'Customer Input'!Q26)","v":""},{"$f":"IF(ISBLANK('Customer Input'!Q26),\"\",VLOOKUP(W26,'Product Information'!$A$2:$C$31,3))","v":""},{"$f":"IF(ISBLANK('Customer Input'!R26),\"\",'Customer Input'!R26)","v":""},{"$f":"IF(ISBLANK('Customer Input'!R26),\"\",VLOOKUP(Y26,'Product Information'!$A$2:$C$31,3))","v":""},{"$f":"IF(ISBLANK('Customer Input'!S26),\"\",'Customer Input'!S26)","v":""},{"$f":"IF(ISBLANK('Customer Input'!S26),\"\",VLOOKUP(AA26,'Product Information'!$A$2:$C$31,3))","v":""},2,549.98,54.99,{"$f":"IF(MATCH(B26,'Order History'!V:V,0)=MAX('Order History'!A:A)-A26+2,0,IF(VLOOKUP(MATCH(B26,'Order History'!V:V,0)-1,'Order History'!$T$2:$AJ$11,17)>199,_xlfn.FLOOR.MATH(AD26*10)/100,0))","v":0},494.99,0,42.17,537.16,null,null,null,"MO",8.1799999999999998E-2]
[{"$f":"IF(ISBLANK('Customer Input'!D27),\"\",ROW()+999)","v":1026},{"$f":"'Customer Input'!D27","v":8785546312},{"$f":"CONCATENATE('Customer Input'!C27,\" \",'Customer Input'!B27)","v":"O'Lantern Jack"},{"$f":"'Customer Input'!A27","v":"2021-10-30"},{"$f":"'Customer Input'!H27","v":"MO"},{"$f":"VLOOKUP(B27,'Customer Information'!$A$2:$I$17,8)","v":2017},{"$f":"IF('Customer Input'!F27=VLOOKUP('Input Calculation'!B27,'Customer Information'!$A$2:$I$17,4),\"No\",\"Yes\")","v":"No"},{"$f":"IF(VLOOKUP(B27,'Customer Information'!$A$2:$I$17,9)=\"Yes\",\"\",\"Attn: Manager\")","v":"Attn: Manager"},{"$f":"IF(ISBLANK('Customer Input'!J27),\"\",'Customer Input'!J27)","v":3055845},{"$f":"IF(ISBLANK('Customer Input'!J27),\"\",VLOOKUP(I27,'Product Information'!$A$2:$C$31,3))","v":199.99},{"$f":"IF(ISBLANK('Customer Input'!K27),\"\",'Customer Input'!K27)","v":""},{"$f":"IF(ISBLANK('Customer Input'!K27),\"\",VLOOKUP(K27,'Product Information'!$A$2:$C$31,3))","v":""},{"$f":"IF(ISBLANK('Customer Input'!L27),\"\",'Customer Input'!L27)","v":""},{"$f":"IF(ISBLANK('Customer Input'!L27),\"\",VLOOKUP(M27,'Product Information'!$A$2:$C$31,3))","v":""},{"$f":"IF(ISBLANK('Customer Input'!M27),\"\",'Customer Input'!M27)","v":""},{"$f":"IF(ISBLANK('Customer Input'!M27),\"\",VLOOKUP(O27,'Product Information'!$A$2:$C$31,3))","v":""},{"$f":"IF(ISBLANK('Customer Input'!N27),\"\",'Customer Input'!N27)","v":""},{"$f":"IF(ISBLANK('Customer Input'!N27),\"\",VLOOKUP(Q27,'Product Information'!$A$2:$C$31,3))","v":""},{"$f":"IF(ISBLANK('Customer Input'!O27),\"\",'Customer Input'!O27)","v":""},{"$f":"IF(ISBLANK('Customer Input'!O27),\"\",VLOOKUP(S27,'Product Information'!$A$2:$C$31,3))","v":""},{"$f":"IF(ISBLANK('Customer Input'!P27),\"\",'Customer Input'!P27)","v":""},{"$f":"IF(ISBLANK('Customer Input'!P27),\"\",VLOOKUP(U27,'Product Information'!$A$2:$C$31,3))","v":""},{"$f":"IF(ISBLANK('Customer Input'!Q27),\"\",'Customer Input'!Q27)","v":""},{"$f":"IF(ISBLANK('Customer Input'!Q27),\"\",VLOOKUP(W27,'Product Information'!$A$2:$C$31,3))","v":""},{"$f":"IF(ISBLANK('Customer Input'!R27),\"\",'Customer Input'!R27)","v":""},{"$f":"IF(ISBLANK('Customer Input'!R27),\"\",VLOOKUP(Y27,'Product Information'!$A$2:$C$31,3))","v":""},{"$f":"IF(ISBLANK('Customer Input'!S27),\"\",'Customer Input'!S27)","v":""},{"$f":"IF(ISBLANK('Customer Input'!S27),\"\",VLOOKUP(AA27,'Product Information'!$A$2:$C$31,3))","v":""},1,199.99,0,{"$f":"IF(MATCH(B27,'Order History'!V:V,0)=MAX('Order History'!A:A)-A27+2,0,IF(VLOOKUP(MATCH(B27,'Order History'!V:V,0)-1,'Order History'!$T$2:$AJ$11,17)>199,_xlfn.FLOOR.MATH(AD27*10)/100,0))","v":0},199.99,5,16.350000000000001,221.34,null,null,null,"MS",7.0699999999999999E-2]
[{"$f":"IF(ISBLANK('Customer Input'!D28),\"\",ROW()+999)","v":1027},{"$f":"'Customer Input'!D28","v":5168832323},{"$f":"CONCATENATE('Customer Input'!C28,\" \",'Customer Input'!B28)","v":"Wont William"},{"$f":"'Customer Input'!A28","v":"2021-10-30"},{"$f":"'Customer Input'!H28","v":"MO"},{"$f":"VLOOKUP(B28,'Customer Information'!$A$2:$I$17,8)","v":2020},{"$f":"IF('Customer Input'!F28=VLOOKUP('Input Calculation'!B28,'Customer Information'!$A$2:$I$17,4),\"No\",\"Yes\")","v":"No"},{"$f":"IF(VLOOKUP(B28,'Customer Information'!$A$2:$I$17,9)=\"Yes\",\"\",\"Attn: Manager\")","v":""},{"$f":"IF(ISBLANK('Customer Input'!J28),\"\",'Customer Input'!J28)","v":2056772},{"$f":"IF(ISBLANK('Customer Input'!J28),\"\",VLOOKUP(I28,'Product Information'!$A$2:$C$31,3))","v":74.989999999999995},{"$f":"IF(ISBLANK('Customer Input'!K28),\"\",'Customer Input'!K28)","v":3055845},{"$f":"IF(ISBLANK('Customer Input'!K28),\"\",VLOOKUP(K28,'Product Information'!$A$2:$C$31,3))","v":199.99},{"$f":"IF(ISBLANK('Customer Input'!L28),\"\",'Customer Input'!L28)","v":""},{"$f":"IF(ISBLANK('Customer Input'!L28),\"\",VLOOKUP(M28,'Product Information'!$A$2:$C$31,3))","v":""},{"$f":"IF(ISBLANK('Customer Input'!M28),\"\",'Customer Input'!M28)","v":""},{"$f":"IF(ISBLANK('Customer Input'!M28),\"\",VLOOKUP(O28,'Product Information'!$A$2:$C$31,3))","v":""},{"$f":"IF(ISBLANK('Customer Input'!N28),\"\",'Customer Input'!N28)","v":""},{"$f":"IF(ISBLANK('Customer Input'!N28),\"\",VLOOKUP(Q28,'Product Information'!$A$2:$C$31,3))","v":""},{"$f":"IF(ISBLANK('Customer Input'!O28),\"\",'Customer Input'!O28)","v":""},{"$f":"IF(ISBLANK('Customer Input'!O28),\"\",VLOOKUP(S28,'Product Information'!$A$2:$C$31,3))","v":""},{"$f":"IF(ISBLANK('Customer Input'!P28),\"\",'Customer Input'!P28)","v":""},{"$f":"IF(ISBLANK('Customer Input'!P28),\"\",VLOOKUP(U28,'Product Information'!$A$2:$C$31,3))","v":""},{"$f":"IF(ISBLANK('Customer Input'!Q28),\"\",'Customer Input'!Q28)","v":""},{"$f":"IF(ISBLANK('Customer Input'!Q28),\"\",VLOOKUP(W28,'Product Information'!$A$2:$C$31,3))","v":""},{"$f":"IF(ISBLANK('Customer Input'!R28),\"\",'Customer Input'!R28)","v":""},{"$f":"IF(ISBLANK('Customer Input'!R28),\"\",VLOOKUP(Y28,'Product Information'!$A$2:$C$31,3))","v":""},{"$f":"IF(ISBLANK('Customer Input'!S28),\"\",'Customer Input'!S28)","v":""},{"$f":"IF(ISBLANK('Customer Input'!S28),\"\",VLOOKUP(AA28,'Product Information'!$A$2:$C$31,3))","v":""},2,274.98,0,{"$f":"IF(MATCH(B28,'Order History'!V:V,0)=MAX('Order History'!A:A)-A28+2,0,IF(VLOOKUP(MATCH(B28,'Order History'!V:V,0)-1,'Order History'!$T$2:$AJ$11,17)>199,_xlfn.FLOOR.MATH(AD28*10)/100,0))","v":0},274.98,5,22.49,302.47000000000003,null,null,null,"MT",0]
[{"$f":"IF(ISBLANK('Customer Input'!D29),\"\",ROW()+999)","v":1028},{"$f":"'Customer Input'!D29","v":9184329830},{"$f":"CONCATENATE('Customer Input'!C29,\" \",'Customer Input'!B29)","v":"Jane Mary"},{"$f":"'Customer Input'!A29","v":"2021-10-30"},{"$f":"'Customer Input'!H29","v":"CO"},{"$f":"VLOOKUP(B29,'Customer Information'!$A$2:$I$17,8)","v":2001},{"$f":"IF('Customer Input'!F29=VLOOKUP('Input Calculation'!B29,'Customer Information'!$A$2:$I$17,4),\"No\",\"Yes\")","v":"No"},{"$f":"IF(VLOOKUP(B29,'Customer Information'!$A$2:$I$17,9)=\"Yes\",\"\",\"Attn: Manager\")","v":"Attn: Manager"},{"$f":"IF(ISBLANK('Customer Input'!J29),\"\",'Customer Input'!J29)","v":2056772},{"$f":"IF(ISBLANK('Customer Input'!J29),\"\",VLOOKUP(I29,'Product Information'!$A$2:$C$31,3))","v":74.989999999999995},{"$f":"IF(ISBLANK('Customer Input'!K29),\"\",'Customer Input'!K29)","v":""},{"$f":"IF(ISBLANK('Customer Input'!K29),\"\",VLOOKUP(K29,'Product Information'!$A$2:$C$31,3))","v":""},{"$f":"IF(ISBLANK('Customer Input'!L29),\"\",'Customer Input'!L29)","v":""},{"$f":"IF(ISBLANK('Customer Input'!L29),\"\",VLOOKUP(M29,'Product Information'!$A$2:$C$31,3))","v":""},{"$f":"IF(ISBLANK('Customer Input'!M29),\"\",'Customer Input'!M29)","v":""},{"$f":"IF(ISBLANK('Customer Input'!M29),\"\",VLOOKUP(O29,'Product Information'!$A$2:$C$31,3))","v":""},{"$f":"IF(ISBLANK('Customer Input'!N29),\"\",'Customer Input'!N29)","v":""},{"$f":"IF(ISBLANK('Customer Input'!N29),\"\",VLOOKUP(Q29,'Product Information'!$A$2:$C$31,3))","v":""},{"$f":"IF(ISBLANK('Customer Input'!O29),\"\",'Customer Input'!O29)","v":""},{"$f":"IF(ISBLANK('Customer Input'!O29),\"\",VLOOKUP(S29,'Product Information'!$A$2:$C$31,3))","v":""},{"$f":"IF(ISBLANK('Customer Input'!P29),\"\",'Customer Input'!P29)","v":""},{"$f":"IF(ISBLANK('Customer Input'!P29),\"\",VLOOKUP(U29,'Product Information'!$A$2:$C$31,3))","v":""},{"$f":"IF(ISBLANK('Customer Input'!Q29),\"\",'Customer Input'!Q29)","v":""},{"$f":"IF(ISBLANK('Customer Input'!Q29),\"\",VLOOKUP(W29,'Product Information'!$A$2:$C$31,3))","v":""},{"$f":"IF(ISBLANK('Customer Input'!R29),\"\",'Customer Input'!R29)","v":""},{"$f":"IF(ISBLANK('Customer Input'!R29),\"\",VLOOKUP(Y29,'Product Information'!$A$2:$C$31,3))","v":""},{"$f":"IF(ISBLANK('Customer Input'!S29),\"\",'Customer Input'!S29)","v":""},{"$f":"IF(ISBLANK('Customer Input'!S29),\"\",VLOOKUP(AA29,'Product Information'!$A$2:$C$31,3))","v":""},1,74.989999999999995,7.49,{"$f":"IF(MATCH(B29,'Order History'!V:V,0)=MAX('Order History'!A:A)-A29+2,0,IF(VLOOKUP(MATCH(B29,'Order History'!V:V,0)-1,'Order History'!$T$2:$AJ$11,17)>199,_xlfn.FLOOR.MATH(AD29*10)/100,0))","v":0},67.5,0,5.16,72.66,null,null,null,"NC",6.9699999999999998E-2]
[null,null,null,null,null,null,null,null,null,null,null,null,null,null,null,null,null,null,null,null,null,null,null,null,null,null,null,null,null,null,null,null,null,null,null,null,null,null,null,"ND",6.8599999999999994E-2]
[null,null,null,null,null,null,null,null,null,null,null,null,null,null,null,null,null,null,null,null,null,null,null,null,null,null,null,null,null,null,null,null,null,null,null,null,null,null,null,"NE",6.93E-2]
[null,null,null,null,null,null,null,null,null,null,null,null,null,null,null,null,null,null,null,null,null,null,null,null,null,null,null,null,null,null,null,null,null,null,null,null,null,null,null,"NH",0]
[null,null,null,null,null,null,null,null,null,null,null,null,null,null,null,null,null,null,null,null,null,null,null,null,null,null,null,null,null,null,null,null,null,null,null,null,null,null,null,"NJ",6.6000000000000003E-2]
[null,null,null,null,null,null,null,null,null,null,null,null,null,null,null,null,null,null,null,null,null,null,null,null,null,null,null,null,null,null,null,null,null,null,null,null,null,null,null,"NM",8.8200000000000001E-2]
[null,null,null,null,null,null,null,null,null,null,null,null,null,null,null,null,null,null,null,null,null,null,null,null,null,null,null,null,null,null,null,null,null,null,null,null,null,null,null,"NV",8.3199999999999996E-2]
[null,null,null,null,null,null,null,null,null,null,null,null,null,null,null,null,null,null,null,null,null,null,null,null,null,null,null,null,null,null,null,null,null,null,null,null,null,null,null,"NY",8.5199999999999998E-2]
[null,null,null,null,null,null,null,null,null,null,null,null,null,null,null,null,null,null,null,null,null,null,null,null,null,null,null,null,null,null,null,null,null,null,null,null,null,null,null,"OH",7.17E-2]
[null,null,null,null,null,null,null,null,null,null,null,null,null,null,null,null,null,null,null,null,null,null,null,null,null,null,null,null,null,null,null,null,null,null,null,null,null,null,null,"OK",8.9399999999999993E-2]
[null,null,null,null,null,null,null,null,null,null,null,null,null,null,null,null,null,null,null,null,null,null,null,null,null,null,null,null,null,null,null,null,null,null,null,null,null,null,null,"OR",0]
[null,null,null,null,null,null,null,null,null,null,null,null,null,null,null,null,null,null,null,null,null,null,null,null,null,null,null,null,null,null,null,null,null,null,null,null,null,null,null,"PA",6.3399999999999998E-2]
[null,null,null,null,null,null,null,null,null,null,null,null,null,null,null,null,null,null,null,null,null,null,null,null,null,null,null,null,null,null,null,null,null,null,null,null,null,null,null,"RI",7.0000000000000007E-2]
[null,null,null,null,null,null,null,null,null,null,null,null,null,null,null,null,null,null,null,null,null,null,null,null,null,null,null,null,null,null,null,null,null,null,null,null,null,null,null,"SC",7.46E-2]
[null,null,null,null,null,null,null,null,null,null,null,null,null,null,null,null,null,null,null,null,null,null,null,null,null,null,null,null,null,null,null,null,null,null,null,null,null,null,null,"SD",6.4000000000000001E-2]
[null,null,null,null,null,null,null,null,null,null,null,null,null,null,null,null,null,null,null,null,null,null,null,null,null,null,null,null,null,null,null,null,null,null,null,null,null,null,null,"TN",9.5299999999999996E-2]
[null,null,null,null,null,null,null,null,null,null,null,null,null,null,null,null,null,null,null,null,null,null,null,null,null,null,null,null,null,null,null,null,null,null,null,null,null,null,null,"TX",8.1900000000000001E-2]
[null,null,null,null,null,null,null,null,null,null,null,null,null,null,null,null,null,null,null,null,null,null,null,null,null,null,null,null,null,null,null,null,null,null,null,null,null,null,null,"UT",7.1800000000000003E-2]
[null,null,null,null,null,null,null,null,null,null,null,null,null,null,null,null,null,null,null,null,null,null,null,null,null,null,null,null,null,null,null,null,null,null,null,null,null,null,null,"VA",5.6500000000000002E-2]
[null,null,null,null,null,null,null,null,null,null,null,null,null,null,null,null,null,null,null,null,null,null,null,null,null,null,null,null,null,null,null,null,null,null,null,null,null,null,null,"VT",6.2199999999999998E-2]
[null,null,null,null,null,null,null,null,null,null,null,null,null,null,null,null,null,null,null,null,null,null,null,null,null,null,null,null,null,null,null,null,null,null,null,null,null,null,null,"WA",9.2100000000000001E-2]
[null,null,null,null,null,null,null,null,null,null,null,null,null,null,null,null,null,null,null,null,null,null,null,null,null,null,null,null,null,null,null,null,null,null,null,null,null,null,null,"WI",5.4600000000000003E-2]
[null,null,null,null,null,null,null,null,null,null,null,null,null,null,null,null,null,null,null,null,null,null,null,null,null,null,null,null,null,null,null,null,null,null,null,null,null,null,null,"WV",6.4100000000000004E-2]
[null,null,null,null,null,null,null,null,null,null,null,null,null,null,null,null,null,null,null,null,null,null,null,null,null,null,null,null,null,null,null,null,null,null,null,null,null,null,null,"WY",5.3400000000000003E-2]

{"sheet":"Customer Information","index":3,"n_rows":15,"n_cols":9,"rows_kept":15,"cut":false,"hidden":false,"merged":[]}
["Phone","Name","Email","Address","City","State","Zip","Customer Since","Good Standing"]
[3056223185,"Rhythm DJ","Tunes@yahoo.com","123 Counting Street","Numbers","OK",97365,2007,"No"]
[4438641204,"Calendar Marie","pies4life@gmail.com","3343 Rhubarb Road","Jacksonville","MI",30243,2021,"Yes"]
[5168832323,"Wont William","NotHere@yahoo.com","823 1st St","Kansas City","MO",65923,2020,"Yes"]
[6315790090,"Caputo Matthew","mattcap62480@gmail.com","7123 Montclair Peak Lane","Richmond","TX",77469,2007,"Yes"]
[6530353532,"Pumpkineater Peter","Orange@mail.com","32 Maple Road","Bloomington","VT",8876,2008,"Yes"]
[7139892245,"Kaploozie Suzie","sk2002@hotmail.com","3 Pine Road","Albany","NY",12313,2003,"Yes"]
[8174368834,"Doe John","noone@yahoo.com","1000 Main Street","Los Angeles","CA",98845,2017,"Yes"]
[8785546312,"O'Lantern Jack","halloween@hotmail.com","666 Evil Road","Hell","MO",10232,2017,"No"]
[9153230352,"Liberace Mister","Piano12@yahoo.com","432 Flamingo Drive","Las Vegas","NV",73547,1985,"Yes"]
[9184329830,"Jane Mary","high@gmail.com","420 Weed Way","Denver","CO",88325,2001,"No"]
[9224318825,"N'Charge Charles","boss@hotmail.com","12 Wandering Road","Laffyette","LA",76523,2015,"Yes"]
[]
["Press Cntr-Shft-E to view all detailed customer data"]
["Press Cntr-Shft-P to protect all detailed customer data"]

{"sheet":"Product Information","index":4,"n_rows":32,"n_cols":6,"rows_kept":32,"cut":false,"hidden":false,"merged":[]}
["Item Number","Description","Price","Total Purchased","Total Per Item","Percent of Total Revenue"]
[1065630,"Shirt",14.99,{"$f":"COUNTIF('Customer Input'!$J$2:$S$29,A2)","v":0},{"$f":"D2*C2","v":0},{"$f":"E2/$E$32","v":0}]
[1201215,"Nicer Shirt",24.99,{"$f":"COUNTIF('Customer Input'!$J$2:$S$29,A3)","v":0},{"$f":"D3*C3","v":0},{"$f":"E3/$E$32","v":0}]
[1252953,"Great Shirt",54.99,{"$f":"COUNTIF('Customer Input'!$J$2:$S$29,A4)","v":1},54.99,6.1930278601788E-3]
[1465559,"Pants",24.99,{"$f":"COUNTIF('Customer Input'!$J$2:$S$29,A5)","v":1},24.99,2.8143983674462302E-3]
[1983220,"Nicer Pants",34.99,{"$f":"COUNTIF('Customer Input'!$J$2:$S$29,A6)","v":1},34.99,3.9406081983570868E-3]
[2056772,"Great Pants",74.989999999999995,{"$f":"COUNTIF('Customer Input'!$J$2:$S$29,A7)","v":7},524.92999999999995,5.9118132654003584E-2]
[2847693,"Jacket",134.99,{"$f":"COUNTIF('Customer Input'!$J$2:$S$29,A8)","v":1},134.99,1.5202706507465653E-2]
[3055845,"Winter Jacket",199.99,{"$f":"COUNTIF('Customer Input'!$J$2:$S$29,A9)","v":12},2399.88,0.27027684490063464]
[3148653,"Leather Jacket",449.99,{"$f":"COUNTIF('Customer Input'!$J$2:$S$29,A10)","v":1},449.99,5.0678316181157632E-2]
[3785616,"Dressy Jacket",499.99,{"$f":"COUNTIF('Customer Input'!$J$2:$S$29,A11)","v":1},499.99,5.630936533571191E-2]
[3818725,"Logo Jacket",999.99,{"$f":"COUNTIF('Customer Input'!$J$2:$S$29,A12)","v":1},999.99,0.11261985688125473]
[3832255,"Hat",19.989999999999998,{"$f":"COUNTIF('Customer Input'!$J$2:$S$29,A13)","v":1},19.989999999999998,2.2512934519908017E-3]
[4192639,"Better Hat",24.99,{"$f":"COUNTIF('Customer Input'!$J$2:$S$29,A14)","v":0},0,0]
[4375770,"Amazing Hat",34.99,{"$f":"COUNTIF('Customer Input'!$J$2:$S$29,A15)","v":0},0,0]
[4989600,"Hard Hat",29.99,{"$f":"COUNTIF('Customer Input'!$J$2:$S$29,A16)","v":2},59.98,6.7550065658033166E-3]
[5086187,"Top Hat",39.99,{"$f":"COUNTIF('Customer Input'!$J$2:$S$29,A17)","v":1},39.99,4.5037131138125153E-3]
[5216388,"Logo Hat",49.99,{"$f":"COUNTIF('Customer Input'!$J$2:$S$29,A18)","v":10},499.90000000000003,5.6299229447233715E-2]
[6671819,"Socks",4.99,{"$f":"COUNTIF('Customer Input'!$J$2:$S$29,A19)","v":1},4.99,5.6197870562451735E-4]
[6738313,"Better Socks",6.99,{"$f":"COUNTIF('Customer Input'!$J$2:$S$29,A20)","v":1},6.99,7.8722067180668866E-4]
[6808398,"Fuzzy Socks",8.99,{"$f":"COUNTIF('Customer Input'!$J$2:$S$29,A21)","v":1},8.99,1.0124626379888599E-3]
[6832283,"Toe Socks",9.99,{"$f":"COUNTIF('Customer Input'!$J$2:$S$29,A22)","v":1},9.99,1.1250836210799455E-3]
[7250412,"Thermal Socks",12.99,{"$f":"COUNTIF('Customer Input'!$J$2:$S$29,A23)","v":8},103.92,1.170357256282562E-2]
[7256628,"Shoes",54.99,{"$f":"COUNTIF('Customer Input'!$J$2:$S$29,A24)","v":0},0,0]
[7278806,"Nicer Shoes",154.99,{"$f":"COUNTIF('Customer Input'!$J$2:$S$29,A25)","v":0},0,0]
[7662209,"Great Shoes",354.99,{"$f":"COUNTIF('Customer Input'!$J$2:$S$29,A26)","v":0},0,0]
[7718381,"Sunglasses",19.989999999999998,{"$f":"COUNTIF('Customer Input'!$J$2:$S$29,A27)","v":0},0,0]
[8299553,"UV Sunglasses",29.99,{"$f":"COUNTIF('Customer Input'!$J$2:$S$29,A28)","v":0},0,0]
[8312428,"IOU Sunglasses",49.99,{"$f":"COUNTIF('Customer Input'!$J$2:$S$29,A29)","v":0},0,0]
[8924251,"Super Sunglasses",99.99,{"$f":"COUNTIF('Customer Input'!$J$2:$S$29,A30)","v":10},999.9,0.11260972099277654]
[9242514,"Fashionista Sunglasses",499.99,{"$f":"COUNTIF('Customer Input'!$J$2:$S$29,A31)","v":4},1999.96,0.22523746134284764]
[null,null,null,"Total Revenue",{"$f":"SUM(E2:E31)","v":8879.3399999999965}]

{"sheet":"Order History","index":5,"n_rows":29,"n_cols":36,"rows_kept":29,"cut":false,"hidden":false,"merged":[]}
["Order Number","Name","Phone","Date","Item 1","Item 2","Item 3","Item 4","Item 5","Item 6","Item 7","Item 8","Item 9","Item 10","Loyalty Discount","Big Spender Discount","Grand Total","Most Recent",null,"Reverse Order Number","Name","Phone","Date","Item 1","Item 2","Item 3","Item 4","Item 5","Item 6","Item 7","Item 8","Item 9","Item 10","Loyalty Discount","Big Spender Discount","Grand Total"]
[{"$f":"'Input Calculation'!A2","v":1001},{"$f":"'Input Calculation'!C2","v":"Caputo Matthew"},{"$f":"'Input Calculation'!B2","v":6315790090},{"$f":"'Input Calculation'!D2","v":"2021-10-24"},{"$f":"'Input Calculation'!I2","v":7250412},{"$f":"'Input Calculation'!K2","v":5216388},{"$f":"'Input Calculation'!M2","v":9242514},{"$f":"'Input Calculation'!O2","v":""},{"$f":"'Input Calculation'!Q2","v":""},{"$f":"'Input Calculation'!S2","v":""},{"$f":"'Input Calculation'!U2","v":""},{"$f":"'Input Calculation'!W2","v":""},{"$f":"'Input Calculation'!Y2","v":""},{"$f":"'Input Calculation'!AA2","v":""},{"$f":"'Input Calculation'!AE2","v":56.29},{"$f":"'Input Calculation'!AF2","v":0},{"$f":"'Input Calculation'!AJ2","v":548.16999999999996},{"$f":"MAX(A:A)-A2+1","v":28},null,{"$f":"A2-1000","v":1},{"$f":"VLOOKUP(MAX($A:$A)-($T2-1),$A$2:$Q$29,COLUMN()-19)","v":"Jane Mary"},{"$f":"VLOOKUP(MAX($A:$A)-($T2-1),$A$2:$Q$29,COLUMN()-19)","v":9184329830},44499,2056772,"","","","","","","","","",7.49,0,72.66]
[{"$f":"'Input Calculation'!A3","v":1002},{"$f":"'Input Calculation'!C3","v":"Doe John"},{"$f":"'Input Calculation'!B3","v":8174368834},{"$f":"'Input Calculation'!D3","v":"2021-10-24"},{"$f":"'Input Calculation'!I3","v":2056772},{"$f":"'Input Calculation'!K3","v":3055845},{"$f":"'Input Calculation'!M3","v":""},{"$f":"'Input Calculation'!O3","v":""},{"$f":"'Input Calculation'!Q3","v":""},{"$f":"'Input Calculation'!S3","v":""},{"$f":"'Input Calculation'!U3","v":""},{"$f":"'Input Calculation'!W3","v":""},{"$f":"'Input Calculation'!Y3","v":""},{"$f":"'Input Calculation'!AA3","v":""},{"$f":"'Input Calculation'!AE3","v":0},{"$f":"'Input Calculation'!AF3","v":0},{"$f":"'Input Calculation'!AJ3","v":303.79000000000002},{"$f":"MAX(A:A)-A3+1","v":27},null,{"$f":"A3-1000","v":2},"Wont William",5168832323,44499,2056772,3055845,"","","","","","","","",0,0,302.47000000000003]
[{"$f":"'Input Calculation'!A4","v":1003},{"$f":"'Input Calculation'!C4","v":"Kaploozie Suzie"},{"$f":"'Input Calculation'!B4","v":7139892245},{"$f":"'Input Calculation'!D4","v":"2021-10-24"},{"$f":"'Input Calculation'!I4","v":3055845},{"$f":"'Input Calculation'!K4","v":""},{"$f":"'Input Calculation'!M4","v":""},{"$f":"'Input Calculation'!O4","v":""},{"$f":"'Input Calculation'!Q4","v":""},{"$f":"'Input Calculation'!S4","v":""},{"$f":"'Input Calculation'!U4","v":""},{"$f":"'Input Calculation'!W4","v":""},{"$f":"'Input Calculation'!Y4","v":""},{"$f":"'Input Calculation'!AA4","v":""},{"$f":"'Input Calculation'!AE4","v":19.989999999999998},{"$f":"'Input Calculation'!AF4","v":19.989999999999998},{"$f":"'Input Calculation'!AJ4","v":173.64},26,null,3,"O'Lantern Jack",8785546312,44499,3055845,"","","","","","","","","",0,0,221.34]
[{"$f":"'Input Calculation'!A5","v":1004},{"$f":"'Input Calculation'!C5","v":"Jane Mary"},{"$f":"'Input Calculation'!B5","v":9184329830},{"$f":"'Input Calculation'!D5","v":"2021-10-25"},{"$f":"'Input Calculation'!I5","v":8924251},{"$f":"'Input Calculation'!K5","v":7250412},{"$f":"'Input Calculation'!M5","v":5216388},{"$f":"'Input Calculation'!O5","v":""},{"$f":"'Input Calculation'!Q5","v":""},{"$f":"'Input Calculation'!S5","v":""},{"$f":"'Input Calculation'!U5","v":""},{"$f":"'Input Calculation'!W5","v":""},{"$f":"'Input Calculation'!Y5","v":""},{"$f":"'Input Calculation'!AA5","v":""},{"$f":"'Input Calculation'!AE5","v":16.29},{"$f":"'Input Calculation'!AF5","v":0},{"$f":"'Input Calculation'!AJ5","v":157.9},25,null,4,"Kaploozie Suzie",7139892245,44499,9242514,5216388,"","","","","","","","",54.99,0,537.16]
[{"$f":"'Input Calculation'!A6","v":1005},{"$f":"'Input Calculation'!C6","v":"Wont William"},{"$f":"'Input Calculation'!B6","v":5168832323},{"$f":"'Input Calculation'!D6","v":"2021-10-25"},{"$f":"'Input Calculation'!I6","v":9242514},{"$f":"'Input Calculation'!K6","v":3055845},{"$f":"'Input Calculation'!M6","v":7250412},{"$f":"'Input Calculation'!O6","v":""},{"$f":"'Input Calculation'!Q6","v":""},{"$f":"'Input Calculation'!S6","v":""},{"$f":"'Input Calculation'!U6","v":""},{"$f":"'Input Calculation'!W6","v":""},{"$f":"'Input Calculation'!Y6","v":""},{"$f":"'Input Calculation'!AA6","v":""},{"$f":"'Input Calculation'!AE6","v":0},{"$f":"'Input Calculation'!AF6","v":71.290000000000006},{"$f":"'Input Calculation'!AJ6","v":694.16000000000008},24,null,5,"Liberace Mister",9153230352,44499,1252953,1465559,1983220,2056772,2847693,3055845,3148653,3785616,3818725,3832255,249.49,0,2432.2199999999998]
[{"$f":"'Input Calculation'!A7","v":1006},{"$f":"'Input Calculation'!C7","v":"Pumpkineater Peter"},{"$f":"'Input Calculation'!B7","v":6530353532},{"$f":"'Input Calculation'!D7","v":"2021-10-25"},{"$f":"'Input Calculation'!I7","v":8924251},{"$f":"'Input Calculation'!K7","v":7250412},{"$f":"'Input Calculation'!M7","v":8924251},{"$f":"'Input Calculation'!O7","v":""},{"$f":"'Input Calculation'!Q7","v":""},{"$f":"'Input Calculation'!S7","v":""},{"$f":"'Input Calculation'!U7","v":""},{"$f":"'Input Calculation'!W7","v":""},{"$f":"'Input Calculation'!Y7","v":""},{"$f":"'Input Calculation'!AA7","v":""},{"$f":"'Input Calculation'!AE7","v":21.29},{"$f":"'Input Calculation'!AF7","v":0},{"$f":"'Input Calculation'!AJ7","v":203.59999999999997},23,null,6,"Caputo Matthew",6315790090,44498,7250412,8924251,"","","","","","","","",11.29,0,110.00999999999999]
[{"$f":"'Input Calculation'!A8","v":1007},{"$f":"'Input Calculation'!C8","v":"O'Lantern Jack"},{"$f":"'Input Calculation'!B8","v":8785546312},{"$f":"'Input Calculation'!D8","v":"2021-10-25"},{"$f":"'Input Calculation'!I8","v":3055845},{"$f":"'Input Calculation'!K8","v":""},{"$f":"'Input Calculation'!M8","v":""},{"$f":"'Input Calculation'!O8","v":""},{"$f":"'Input Calculation'!Q8","v":""},{"$f":"'Input Calculation'!S8","v":""},{"$f":"'Input Calculation'!U8","v":""},{"$f":"'Input Calculation'!W8","v":""},{"$f":"'Input Calculation'!Y8","v":""},{"$f":"'Input Calculation'!AA8","v":""},{"$f":"'Input Calculation'!AE8","v":0},{"$f":"'Input Calculation'!AF8","v":19.989999999999998},{"$f":"'Input Calculation'!AJ8","v":194.72},22,null,7,"Pumpkineater Peter",6530353532,44498,8924251,"","","","","","","","","",9.99,0,95.59]
[{"$f":"'Input Calculation'!A9","v":1008},{"$f":"'Input Calculation'!C9","v":"Jane Mary"},{"$f":"'Input Calculation'!B9","v":9184329830},{"$f":"'Input Calculation'!D9","v":"2021-10-26"},{"$f":"'Input Calculation'!I9","v":8924251},{"$f":"'Input Calculation'!K9","v":2056772},{"$f":"'Input Calculation'!M9","v":""},{"$f":"'Input Calculation'!O9","v":""},{"$f":"'Input Calculation'!Q9","v":""},{"$f":"'Input Calculation'!S9","v":""},{"$f":"'Input Calculation'!U9","v":""},{"$f":"'Input Calculation'!W9","v":""},{"$f":"'Input Calculation'!Y9","v":""},{"$f":"'Input Calculation'!AA9","v":""},{"$f":"'Input Calculation'!AE9","v":17.489999999999998},{"$f":"'Input Calculation'!AF9","v":0},{"$f":"'Input Calculation'!AJ9","v":169.52999999999997},21,null,8,"Doe John",8174368834,44498,5216388,"","","","","","","","","",0,0,59.309000000000005]
[{"$f":"'Input Calculation'!A10","v":1009},{"$f":"'Input Calculation'!C10","v":"Kaploozie Suzie"},{"$f":"'Input Calculation'!B10","v":7139892245},{"$f":"'Input Calculation'!D10","v":"2021-10-26"},{"$f":"'Input Calculation'!I10","v":2056772},{"$f":"'Input Calculation'!K10","v":""},{"$f":"'Input Calculation'!M10","v":""},{"$f":"'Input Calculation'!O10","v":""},{"$f":"'Input Calculation'!Q10","v":""},{"$f":"'Input Calculation'!S10","v":""},{"$f":"'Input Calculation'!U10","v":""},{"$f":"'Input Calculation'!W10","v":""},{"$f":"'Input Calculation'!Y10","v":""},{"$f":"'Input Calculation'!AA10","v":""},{"$f":"'Input Calculation'!AE10","v":7.49},{"$f":"'Input Calculation'!AF10","v":7.49},{"$f":"'Input Calculation'!AJ10","v":65.12},20,null,9,"Caputo Matthew",6315790090,44498,8924251,5216388,"","","","","","","","",14.99,0,146.04]
[{"$f":"'Input Calculation'!A11","v":1010},{"$f":"'Input Calculation'!C11","v":"Pumpkineater Peter"},{"$f":"'Input Calculation'!B11","v":6530353532},{"$f":"'Input Calculation'!D11","v":"2021-10-26"},{"$f":"'Input Calculation'!I11","v":3055845},{"$f":"'Input Calculation'!K11","v":2056772},{"$f":"'Input Calculation'!M11","v":5216388},{"$f":"'Input Calculation'!O11","v":""},{"$f":"'Input Calculation'!Q11","v":""},{"$f":"'Input Calculation'!S11","v":""},{"$f":"'Input Calculation'!U11","v":""},{"$f":"'Input Calculation'!W11","v":""},{"$f":"'Input Calculation'!Y11","v":""},{"$f":"'Input Calculation'!AA11","v":""},{"$f":"'Input Calculation'!AE11","v":32.49},{"$f":"'Input Calculation'!AF11","v":0},{"$f":"'Input Calculation'!AJ11","v":310.67},19,null,10,"N'Charge Charles",9224318825,44497,8924251,5216388,"","","","","","","","",0,0,168.79]
[{"$f":"'Input Calculation'!A12","v":1011},{"$f":"'Input Calculation'!C12","v":"Calendar Marie"},{"$f":"'Input Calculation'!B12","v":4438641204},{"$f":"'Input Calculation'!D12","v":"2021-10-27"},{"$f":"'Input Calculation'!I12","v":5216388},{"$f":"'Input Calculation'!K12","v":7250412},{"$f":"'Input Calculation'!M12","v":9242514},{"$f":"'Input Calculation'!O12","v":""},{"$f":"'Input Calculation'!Q12","v":""},{"$f":"'Input Calculation'!S12","v":""},{"$f":"'Input Calculation'!U12","v":""},{"$f":"'Input Calculation'!W12","v":""},{"$f":"'Input Calculation'!Y12","v":""},{"$f":"'Input Calculation'!AA12","v":""},{"$f":"'Input Calculation'!AE12","v":0},{"$f":"'Input Calculation'!AF12","v":0},{"$f":"'Input Calculation'!AJ12","v":601.74},18,null,11,"O'Lantern Jack",8785546312,44497,3055845,"","","","","","","","","",0,19.989999999999998,194.72]
[{"$f":"'Input Calculation'!A13","v":1012},{"$f":"'Input Calculation'!C13","v":"Kaploozie Suzie"},{"$f":"'Input Calculation'!B13","v":7139892245},{"$f":"'Input Calculation'!D13","v":"2021-10-27"},{"$f":"'Input Calculation'!I13","v":3055845},{"$f":"'Input Calculation'!K13","v":8924251},{"$f":"'Input Calculation'!M13","v":""},{"$f":"'Input Calculation'!O13","v":""},{"$f":"'Input Calculation'!Q13","v":""},{"$f":"'Input Calculation'!S13","v":""},{"$f":"'Input Calculation'!U13","v":""},{"$f":"'Input Calculation'!W13","v":""},{"$f":"'Input Calculation'!Y13","v":""},{"$f":"'Input Calculation'!AA13","v":""},{"$f":"'Input Calculation'!AE13","v":29.99},{"$f":"'Input Calculation'!AF13","v":29.99},{"$f":"'Input Calculation'!AJ13","v":260.44},17,null,12,"Jane Mary",9184329830,44497,3055845,"","","","","","","","","",19.989999999999998,0,193.77]
[{"$f":"'Input Calculation'!A14","v":1013},{"$f":"'Input Calculation'!C14","v":"Wont William"},{"$f":"'Input Calculation'!B14","v":5168832323},{"$f":"'Input Calculation'!D14","v":"2021-10-27"},{"$f":"'Input Calculation'!I14","v":8924251},{"$f":"'Input Calculation'!K14","v":4989600},{"$f":"'Input Calculation'!M14","v":5086187},{"$f":"'Input Calculation'!O14","v":5216388},{"$f":"'Input Calculation'!Q14","v":6671819},{"$f":"'Input Calculation'!S14","v":6738313},{"$f":"'Input Calculation'!U14","v":6808398},{"$f":"'Input Calculation'!W14","v":6832283},{"$f":"'Input Calculation'!Y14","v":7250412},{"$f":"'Input Calculation'!AA14","v":""},{"$f":"'Input Calculation'!AE14","v":0},{"$f":"'Input Calculation'!AF14","v":26.39},{"$f":"'Input Calculation'!AJ14","v":256.94000000000005},16,null,13,"Rhythm DJ",3056223185,44497,4989600,3055845,"","","","","","","","",22.99,0,221.58]
[{"$f":"'Input Calculation'!A15","v":1014},{"$f":"'Input Calculation'!C15","v":"Doe John"},{"$f":"'Input Calculation'!B15","v":8174368834},{"$f":"'Input Calculation'!D15","v":"2021-10-27"},{"$f":"'Input Calculation'!I15","v":7250412},{"$f":"'Input Calculation'!K15","v":""},{"$f":"'Input Calculation'!M15","v":""},{"$f":"'Input Calculation'!O15","v":""},{"$f":"'Input Calculation'!Q15","v":""},{"$f":"'Input Calculation'!S15","v":""},{"$f":"'Input Calculation'!U15","v":""},{"$f":"'Input Calculation'!W15","v":""},{"$f":"'Input Calculation'!Y15","v":""},{"$f":"'Input Calculation'!AA15","v":""},{"$f":"'Input Calculation'!AE15","v":0},{"$f":"'Input Calculation'!AF15","v":0},{"$f":"'Input Calculation'!AJ15","v":15.408999999999999},15,null,14,"Caputo Matthew",6315790090,44496,5216388,"","","","","","","","","",4.99,0,48.68]
[{"$f":"'Input Calculation'!A16","v":1015},{"$f":"'Input Calculation'!C16","v":"Caputo Matthew"},{"$f":"'Input Calculation'!B16","v":6315790090},{"$f":"'Input Calculation'!D16","v":"2021-10-27"},{"$f":"'Input Calculation'!I16","v":5216388},{"$f":"'Input Calculation'!K16","v":""},{"$f":"'Input Calculation'!M16","v":""},{"$f":"'Input Calculation'!O16","v":""},{"$f":"'Input Calculation'!Q16","v":""},{"$f":"'Input Calculation'!S16","v":""},{"$f":"'Input Calculation'!U16","v":""},{"$f":"'Input Calculation'!W16","v":""},{"$f":"'Input Calculation'!Y16","v":""},{"$f":"'Input Calculation'!AA16","v":""},{"$f":"'Input Calculation'!AE16","v":4.99},{"$f":"'Input Calculation'!AF16","v":0},{"$f":"'Input Calculation'!AJ16","v":48.68},14,null,15,"Doe John",8174368834,44496,7250412,"","","","","","","","","",0,0,15.408999999999999]
[{"$f":"'Input Calculation'!A17","v":1016},{"$f":"'Input Calculation'!C17","v":"Rhythm DJ"},{"$f":"'Input Calculation'!B17","v":3056223185},{"$f":"'Input Calculation'!D17","v":"2021-10-28"},{"$f":"'Input Calculation'!I17","v":4989600},{"$f":"'Input Calculation'!K17","v":3055845},{"$f":"'Input Calculation'!M17","v":""},{"$f":"'Input Calculation'!O17","v":""},{"$f":"'Input Calculation'!Q17","v":""},{"$f":"'Input Calculation'!S17","v":""},{"$f":"'Input Calculation'!U17","v":""},{"$f":"'Input Calculation'!W17","v":""},{"$f":"'Input Calculation'!Y17","v":""},{"$f":"'Input Calculation'!AA17","v":""},{"$f":"'Input Calculation'!AE17","v":22.99},{"$f":"'Input Calculation'!AF17","v":0},{"$f":"'Input Calculation'!AJ17","v":221.58},13,null,16,"Wont William",5168832323,44496,8924251,4989600,5086187,5216388,6671819,6738313,6808398,6832283,7250412,"",0,26.39,256.94000000000005]
[{"$f":"'Input Calculation'!A18","v":1017},{"$f":"'Input Calculation'!C18","v":"Jane Mary"},{"$f":"'Input Calculation'!B18","v":9184329830},{"$f":"'Input Calculation'!D18","v":"2021-10-28"},{"$f":"'Input Calculation'!I18","v":3055845},{"$f":"'Input Calculation'!K18","v":""},{"$f":"'Input Calculation'!M18","v":""},{"$f":"'Input Calculation'!O18","v":""},{"$f":"'Input Calculation'!Q18","v":""},{"$f":"'Input Calculation'!S18","v":""},{"$f":"'Input Calculation'!U18","v":""},{"$f":"'Input Calculation'!W18","v":""},{"$f":"'Input Calculation'!Y18","v":""},{"$f":"'Input Calculation'!AA18","v":""},{"$f":"'Input Calculation'!AE18","v":19.989999999999998},{"$f":"'Input Calculation'!AF18","v":0},{"$f":"'Input Calculation'!AJ18","v":193.77},12,null,17,"Kaploozie Suzie",{"$f":"VLOOKUP(MAX($A:$A)-($T18-1),$A$2:$Q$29,COLUMN()-19)","v":7139892245},44496,3055845,8924251,"","","","","","","","",29.99,29.99,260.44]
[{"$f":"'Input Calculation'!A19","v":1018},{"$f":"'Input Calculation'!C19","v":"O'Lantern Jack"},{"$f":"'Input Calculation'!B19","v":8785546312},{"$f":"'Input Calculation'!D19","v":"2021-10-28"},{"$f":"'Input Calculation'!I19","v":3055845},{"$f":"'Input Calculation'!K19","v":""},{"$f":"'Input Calculation'!M19","v":""},{"$f":"'Input Calculation'!O19","v":""},{"$f":"'Input Calculation'!Q19","v":""},{"$f":"'Input Calculation'!S19","v":""},{"$f":"'Input Calculation'!U19","v":""},{"$f":"'Input Calculation'!W19","v":""},{"$f":"'Input Calculation'!Y19","v":""},{"$f":"'Input Calculation'!AA19","v":""},{"$f":"'Input Calculation'!AE19","v":0},{"$f":"'Input Calculation'!AF19","v":19.989999999999998},{"$f":"'Input Calculation'!AJ19","v":194.72},11,null,18,"Calendar Marie",4438641204,44496,5216388,7250412,9242514,"","","","","","","",0,0,601.74]
[{"$f":"'Input Calculation'!A20","v":1019},{"$f":"'Input Calculation'!C20","v":"N'Charge Charles"},{"$f":"'Input Calculation'!B20","v":9224318825},{"$f":"'Input Calculation'!D20","v":"2021-10-28"},{"$f":"'Input Calculation'!I20","v":8924251},{"$f":"'Input Calculation'!K20","v":5216388},{"$f":"'Input Calculation'!M20","v":""},{"$f":"'Input Calculation'!O20","v":""},{"$f":"'Input Calculation'!Q20","v":""},{"$f":"'Input Calculation'!S20","v":""},{"$f":"'Input Calculation'!U20","v":""},{"$f":"'Input Calculation'!W20","v":""},{"$f":"'Input Calculation'!Y20","v":""},{"$f":"'Input Calculation'!AA20","v":""},{"$f":"'Input Calculation'!AE20","v":0},{"$f":"'Input Calculation'!AF20","v":0},{"$f":"'Input Calculation'!AJ20","v":168.79},10,null,19,"Pumpkineater Peter",6530353532,44495,3055845,2056772,5216388,"","","","","","","",32.49,0,310.67]
[{"$f":"'Input Calculation'!A21","v":1020},{"$f":"'Input Calculation'!C21","v":"Caputo Matthew"},{"$f":"'Input Calculation'!B21","v":6315790090},{"$f":"'Input Calculation'!D21","v":"2021-10-29"},{"$f":"'Input Calculation'!I21","v":8924251},{"$f":"'Input Calculation'!K21","v":5216388},{"$f":"'Input Calculation'!M21","v":""},{"$f":"'Input Calculation'!O21","v":""},{"$f":"'Input Calculation'!Q21","v":""},{"$f":"'Input Calculation'!S21","v":""},{"$f":"'Input Calculation'!U21","v":""},{"$f":"'Input Calculation'!W21","v":""},{"$f":"'Input Calculation'!Y21","v":""},{"$f":"'Input Calculation'!AA21","v":""},{"$f":"'Input Calculation'!AE21","v":14.99},{"$f":"'Input Calculation'!AF21","v":0},{"$f":"'Input Calculation'!AJ21","v":146.04},9,null,20,"Kaploozie Suzie",7139892245,44495,2056772,"","","","","","","","","",7.49,7.49,65.12]
[{"$f":"'Input Calculation'!A22","v":1021},{"$f":"'Input Calculation'!C22","v":"Doe John"},{"$f":"'Input Calculation'!B22","v":8174368834},{"$f":"'Input Calculation'!D22","v":"2021-10-29"},{"$f":"'Input Calculation'!I22","v":5216388},{"$f":"'Input Calculation'!K22","v":""},{"$f":"'Input Calculation'!M22","v":""},{"$f":"'Input Calculation'!O22","v":""},{"$f":"'Input Calculation'!Q22","v":""},{"$f":"'Input Calculation'!S22","v":""},{"$f":"'Input Calculation'!U22","v":""},{"$f":"'Input Calculation'!W22","v":""},{"$f":"'Input Calculation'!Y22","v":""},{"$f":"'Input Calculation'!AA22","v":""},{"$f":"'Input Calculation'!AE22","v":0},{"$f":"'Input Calculation'!AF22","v":0},{"$f":"'Input Calculation'!AJ22","v":59.309000000000005},8,null,21,"Jane Mary",9184329830,44495,8924251,2056772,"","","","","","","","",17.489999999999998,0,169.52999999999997]
[{"$f":"'Input Calculation'!A23","v":1022},{"$f":"'Input Calculation'!C23","v":"Pumpkineater Peter"},{"$f":"'Input Calculation'!B23","v":6530353532},{"$f":"'Input Calculation'!D23","v":"2021-10-29"},{"$f":"'Input Calculation'!I23","v":8924251},{"$f":"'Input Calculation'!K23","v":""},{"$f":"'Input Calculation'!M23","v":""},{"$f":"'Input Calculation'!O23","v":""},{"$f":"'Input Calculation'!Q23","v":""},{"$f":"'Input Calculation'!S23","v":""},{"$f":"'Input Calculation'!U23","v":""},{"$f":"'Input Calculation'!W23","v":""},{"$f":"'Input Calculation'!Y23","v":""},{"$f":"'Input Calculation'!AA23","v":""},{"$f":"'Input Calculation'!AE23","v":9.99},{"$f":"'Input Calculation'!AF23","v":0},{"$f":"'Input Calculation'!AJ23","v":95.59},7,null,22,"O'Lantern Jack",8785546312,44494,3055845,"","","","","","","","","",0,19.989999999999998,194.72]
[{"$f":"'Input Calculation'!A24","v":1023},{"$f":"'Input Calculation'!C24","v":"Caputo Matthew"},{"$f":"'Input Calculation'!B24","v":6315790090},{"$f":"'Input Calculation'!D24","v":"2021-10-29"},{"$f":"'Input Calculation'!I24","v":7250412},{"$f":"'Input Calculation'!K24","v":8924251},{"$f":"'Input Calculation'!M24","v":""},{"$f":"'Input Calculation'!O24","v":""},{"$f":"'Input Calculation'!Q24","v":""},{"$f":"'Input Calculation'!S24","v":""},{"$f":"'Input Calculation'!U24","v":""},{"$f":"'Input Calculation'!W24","v":""},{"$f":"'Input Calculation'!Y24","v":""},{"$f":"'Input Calculation'!AA24","v":""},{"$f":"'Input Calculation'!AE24","v":11.29},{"$f":"'Input Calculation'!AF24","v":0},{"$f":"'Input Calculation'!AJ24","v":110.00999999999999},6,null,23,"Pumpkineater Peter",6530353532,44494,8924251,7250412,8924251,"","","","","","","",21.29,0,203.59999999999997]
[{"$f":"'Input Calculation'!A25","v":1024},{"$f":"'Input Calculation'!C25","v":"Liberace Mister"},{"$f":"'Input Calculation'!B25","v":9153230352},{"$f":"'Input Calculation'!D25","v":"2021-10-30"},{"$f":"'Input Calculation'!I25","v":1252953},{"$f":"'Input Calculation'!K25","v":1465559},{"$f":"'Input Calculation'!M25","v":1983220},{"$f":"'Input Calculation'!O25","v":2056772},{"$f":"'Input Calculation'!Q25","v":2847693},{"$f":"'Input Calculation'!S25","v":3055845},{"$f":"'Input Calculation'!U25","v":3148653},{"$f":"'Input Calculation'!W25","v":3785616},{"$f":"'Input Calculation'!Y25","v":3818725},{"$f":"'Input Calculation'!AA25","v":3832255},{"$f":"'Input Calculation'!AE25","v":249.49},{"$f":"'Input Calculation'!AF25","v":0},{"$f":"'Input Calculation'!AJ25","v":2432.2199999999998},5,null,24,"Wont William",5168832323,44494,9242514,3055845,7250412,"","","","","","","",0,71.290000000000006,694.16000000000008]
[{"$f":"'Input Calculation'!A26","v":1025},{"$f":"'Input Calculation'!C26","v":"Kaploozie Suzie"},{"$f":"'Input Calculation'!B26","v":7139892245},{"$f":"'Input Calculation'!D26","v":"2021-10-30"},{"$f":"'Input Calculation'!I26","v":9242514},{"$f":"'Input Calculation'!K26","v":5216388},{"$f":"'Input Calculation'!M26","v":""},{"$f":"'Input Calculation'!O26","v":""},{"$f":"'Input Calculation'!Q26","v":""},{"$f":"'Input Calculation'!S26","v":""},{"$f":"'Input Calculation'!U26","v":""},{"$f":"'Input Calculation'!W26","v":""},{"$f":"'Input Calculation'!Y26","v":""},{"$f":"'Input Calculation'!AA26","v":""},{"$f":"'Input Calculation'!AE26","v":54.99},{"$f":"'Input Calculation'!AF26","v":0},{"$f":"'Input Calculation'!AJ26","v":537.16},4,null,25,"Jane Mary",9184329830,44494,8924251,7250412,5216388,"","","","","","","",16.29,0,157.9]
[{"$f":"'Input Calculation'!A27","v":1026},{"$f":"'Input Calculation'!C27","v":"O'Lantern Jack"},{"$f":"'Input Calculation'!B27","v":8785546312},{"$f":"'Input Calculation'!D27","v":"2021-10-30"},{"$f":"'Input Calculation'!I27","v":3055845},{"$f":"'Input Calculation'!K27","v":""},{"$f":"'Input Calculation'!M27","v":""},{"$f":"'Input Calculation'!O27","v":""},{"$f":"'Input Calculation'!Q27","v":""},{"$f":"'Input Calculation'!S27","v":""},{"$f":"'Input Calculation'!U27","v":""},{"$f":"'Input Calculation'!W27","v":""},{"$f":"'Input Calculation'!Y27","v":""},{"$f":"'Input Calculation'!AA27","v":""},{"$f":"'Input Calculation'!AE27","v":0},{"$f":"'Input Calculation'!AF27","v":0},{"$f":"'Input Calculation'!AJ27","v":221.34},3,null,26,"Kaploozie Suzie",7139892245,44493,3055845,"","","","","","","","","",19.989999999999998,19.989999999999998,173.64]
[{"$f":"'Input Calculation'!A28","v":1027},{"$f":"'Input Calculation'!C28","v":"Wont William"},{"$f":"'Input Calculation'!B28","v":5168832323},{"$f":"'Input Calculation'!D28","v":"2021-10-30"},{"$f":"'Input Calculation'!I28","v":2056772},{"$f":"'Input Calculation'!K28","v":3055845},{"$f":"'Input Calculation'!M28","v":""},{"$f":"'Input Calculation'!O28","v":""},{"$f":"'Input Calculation'!Q28","v":""},{"$f":"'Input Calculation'!S28","v":""},{"$f":"'Input Calculation'!U28","v":""},{"$f":"'Input Calculation'!W28","v":""},{"$f":"'Input Calculation'!Y28","v":""},{"$f":"'Input Calculation'!AA28","v":""},{"$f":"'Input Calculation'!AE28","v":0},{"$f":"'Input Calculation'!AF28","v":0},{"$f":"'Input Calculation'!AJ28","v":302.47000000000003},2,null,27,"Doe John",8174368834,44493,2056772,3055845,"","","","","","","","",0,0,303.79000000000002]
[{"$f":"'Input Calculation'!A29","v":1028},{"$f":"'Input Calculation'!C29","v":"Jane Mary"},{"$f":"'Input Calculation'!B29","v":9184329830},{"$f":"'Input Calculation'!D29","v":"2021-10-30"},{"$f":"'Input Calculation'!I29","v":2056772},{"$f":"'Input Calculation'!K29","v":""},{"$f":"'Input Calculation'!M29","v":""},{"$f":"'Input Calculation'!O29","v":""},{"$f":"'Input Calculation'!Q29","v":""},{"$f":"'Input Calculation'!S29","v":""},{"$f":"'Input Calculation'!U29","v":""},{"$f":"'Input Calculation'!W29","v":""},{"$f":"'Input Calculation'!Y29","v":""},{"$f":"'Input Calculation'!AA29","v":""},{"$f":"'Input Calculation'!AE29","v":7.49},{"$f":"'Input Calculation'!AF29","v":0},{"$f":"'Input Calculation'!AJ29","v":72.66},1,null,28,"Caputo Matthew",6315790090,44493,7250412,5216388,9242514,"","","","","","","",56.29,0,548.16999999999996]

{"sheet":"Create Customer Claim","index":6,"n_rows":32,"n_cols":59,"rows_kept":32,"cut":false,"hidden":false,"merged":[]}
["Script:",null,null,null,null,null,null,null,null,null,null,null,null,null,null,null,null,null,null,null,null,"Number","Month",null,null,"Claim Assignment",null,null,"Weekday Assignment",null,null,null,"number","letter"]
[null,null,null,null,null,null,null,null,null,null,null,null,null,null,null,null,null,null,null,null,null,1,"January",null,null,0,"Mark",null,1,"Sunday",null,null,0,"A"]
["\"Hello.  To whom do I have the pleasure of speaking?\"",null,null,null,null,null,null,null,null,null,null,null,null,null,null,null,null,null,null,null,null,2,"February",null,null,1,"Bob",null,2,"Monday",null,null,3,"B"]
["Response: ",null,null,null,null,null,null,null,null,null,null,null,null,null,null,null,null,null,null,null,null,3,"March",null,null,2,"Sandy",null,3,"Tuesday",null,null,6,"C"]
["\"Would you mind verifying the phone number associated with this account?\"",null,null,null,null,null,null,null,null,null,null,null,null,null,null,null,null,null,null,null,null,4,"April",null,null,3,"Aiden",null,4,"Wednesday",null,null,10,"D"]
["Reponse:",null,null,null,"Press Cnt-Sht V to Find Customer",null,null,null,null,null,null,null,null,null,null,null,null,null,null,null,null,5,"May",null,null,4,"Mary",null,5,"Thursday",null,null,13,"E"]
[null,null,null,null,"Press Cnt-Sht P to Find Protect",null,null,null,null,null,null,null,null,null,null,null,null,null,null,null,null,6,"June",null,null,5,"Marty",null,6,"Friday",null,null,16,"F"]
[null,null,null,null,null,null,null,null,null,null,null,null,null,null,null,null,null,null,null,null,null,7,"July",null,null,6,"Sal",null,7,"Saturday",null,null,20,"G"]
[null,null,null,null,null,null,null,null,null,null,null,null,null,null,null,null,null,null,null,null,null,8,"August",null,null,7,"Jim",null,null,null,null,null,23,"H"]
["Name:",{"$f":"VLOOKUP(B6,'Customer Information'!$A$2:$I$12,2)","v":{"$error":"#N/A"}},null,null,null,null,null,null,null,null,null,null,null,null,null,null,null,null,null,null,null,9,"September",null,null,8,"Peter",null,null,null,null,null,26,"I"]
[null,null,null,null,null,null,null,null,null,null,null,null,null,null,null,null,null,null,null,null,null,10,"October",null,null,9,"Leslie",null,null,null,null,null,30,"J"]
["Phone:",{"$f":"TEXT(B6,\"###-###-####\")","v":"--"},null,null,null,null,null,null,null,null,null,null,null,null,null,null,null,null,null,null,null,11,"November",null,null,null,null,null,null,null,null,null,33,"K"]
["Email:",{"$f":"VLOOKUP(B6,'Customer Information'!$A$2:$I$12,3)","v":{"$error":"#N/A"}},null,null,null,null,null,null,null,null,null,null,null,null,null,null,null,null,null,null,null,12,"December",null,null,null,null,null,null,null,null,null,36,"L"]
[null,null,null,null,null,null,null,null,null,null,null,null,null,null,null,null,null,null,null,null,null,null,null,null,null,null,null,null,null,null,null,null,40,"M"]
["Last Order:",{"$f":"MAX('Order History'!A2:A29,)-MATCH(B6,'Order History'!V1:V29,0)+2","v":{"$error":"#N/A"}},"Product: ",{"$f":"VLOOKUP(B15,'Order History'!$A$2:$N$29,5)","v":{"$error":"#N/A"}},null,null,null,null,null,null,null,null,null,null,null,null,null,null,null,null,null,null,null,null,null,null,null,null,null,null,null,null,43,"N"]
["Date:",{"$f":"YEAR(VLOOKUP(B15,'Order History'!$A$2:$Q$29,4))","v":{"$error":"#N/A"}},{"$f":"MONTH(VLOOKUP(B15,'Order History'!$A$2:$Q$29,4))","v":{"$error":"#N/A"}},{"$f":"DAY(VLOOKUP(B15,'Order History'!$A$2:$Q$29,4))","v":{"$error":"#N/A"}},{"$f":"WEEKDAY(DATE(B16,MONTH(VLOOKUP(B15,'Order History'!$A$2:$Q$29,4)),D16))","v":{"$error":"#N/A"}},{"$f":"VLOOKUP(E16,AC2:AD8,2)","v":{"$error":"#N/A"}},null,null,null,null,null,null,null,"Order","Date of Order","Date of Claim","Product","Phone","Weekday Order","Weekday Claim","Assigned",null,null,null,null,null,null,null,null,null,null,null,46,"O"]
[null,null,{"$f":"VLOOKUP(C16,V2:W13,2)","v":{"$error":"#N/A"}},null,null,null,null,null,null,null,null,null,null,4,8,8,7,10,1,1,1,4737342,null,null,null,null,null,null,null,null,null,null,50,"P"]
["Assigned to:",3,{"$f":"VLOOKUP(_xlfn.NUMBERVALUE(B18),Z2:AA11,2)","v":"Aiden"},null,null,null,null,null,null,null,null,null,null,null,"yyyymmdd","yyyymmdd",null,null,null,null,null,null,null,null,null,null,null,null,null,null,null,null,53,"Q"]
["Date: ",{"$f":"TEXT(YEAR(TODAY()),\"####\")","v":"2021"},{"$f":"TEXT(MONTH(TODAY()),\"##\")","v":"10"},{"$f":"TEXT(DAY(TODAY()),\"##\")","v":"31"},{"$f":"WEEKDAY(DATE(B19,C19,D19))","v":1},{"$f":"VLOOKUP(E19,AC2:AD8,2)","v":"Sunday"},null,null,null,null,null,null,null,null,null,null,null,null,null,null,null,null,null,null,null,null,null,null,null,null,null,null,56,"R"]
[null,null,{"$f":"VLOOKUP(_xlfn.NUMBERVALUE(C19),V2:W13,2)","v":"October"},null,null,null,null,null,null,null,null,null,null,null,null,null,null,null,null,null,null,null,null,null,null,null,null,null,null,null,null,null,60,"S"]
["Claim Number:",{"$f":"M32","v":{"$error":"#N/A"}},null,null,null,null,null,null,null,null,null,null,null,null,null,null,null,null,null,null,null,null,null,null,null,null,null,null,null,null,null,null,65,"T"]
[null,null,null,null,null,null,null,null,null,null,null,null,null,null,null,null,null,null,null,null,null,null,null,null,null,null,null,null,null,null,null,null,70,"U"]
[null,null,null,null,null,null,null,null,null,null,null,null,null,null,null,null,null,null,3,null,null,null,null,null,null,null,null,null,null,null,null,null,75,"V"]
[null,null,null,null,null,null,null,null,null,null,null,null,null,null,null,null,null,null,null,null,null,null,null,null,null,null,null,null,null,null,1,null,80,"W",null,null,null,null,null,null,null,null,null,null,null,null,null,null,null,null,4,null,null,null,null,2]
[null,null,null,null,null,null,null,null,null,null,null,null,null,null,null,null,null,null,null,null,null,null,null,null,null,null,null,null,null,null,null,null,85,"X"]
[null,null,null,null,null,null,null,null,null,null,null,null,"t5","p7","t1","d7","d2wc","r2","o1wo","t9","d1wc","r5","t4","c3","r7","t3","c1","d8","r3","r1","o1wo","p4",90,"Y","p6","p3","c7","p5","p2","r8","t2","d3wc","c2","d0wc","t8","d4wc","t6","c4","t7","t0","o1wo","r4","c6","c5","d6","o1wo","c8","d5","p1"]
[null,null,null,null,null,null,null,null,null,null,null,null,null,null,null,null,null,null,null,null,null,null,null,null,null,null,null,null,null,null,null,null,95,"Z"]
[null,null,null,null,null,null,null,null,null,null,null,null,null,null,null,null,null,null,null,null,null,null,null,null,null,null,null,null,null,null,null,null,"a1","r6"]
[null,null,null,null,null,null,null,null,null,null,null,null,{"$f":"MID(B6,5,1)","v":""},{"$f":"MID(D15,7,1)","v":{"$error":"#N/A"}},{"$f":"MID(B6,1,1)","v":""},{"$f":"LEFT(D16,1)","v":{"$error":"#N/A"}},{"$f":"MID(E19*B16,3,1)","v":{"$error":"#N/A"}},{"$f":"MID(V17,2,1)","v":"7"},{"$f":"MID(E16*B15,3,1)","v":{"$error":"#N/A"}},{"$f":"MID(B6,9,1)","v":""},{"$f":"MID(B16*E19,2,1)","v":{"$error":"#N/A"}},{"$f":"MID(V17,5,1)","v":"3"},{"$f":"MID(B6,4,1)","v":""},{"$f":"MID(B19,3,1)","v":"2"},{"$f":"MID(V17,7,1)","v":"2"},{"$f":"MID(B6,3,1)","v":""},{"$f":"MID(B19,1,1)","v":"2"},{"$f":"RIGHT(D16,1)","v":{"$error":"#N/A"}},{"$f":"MID(V17,3,1)","v":"3"},{"$f":"LEFT(V17,1)","v":"4"},{"$f":"MID(E16*B15,1,1)","v":{"$error":"#N/A"}},{"$f":"MID(D15,4,1)","v":{"$error":"#N/A"}},{"$f":"B18","v":3},{"$f":"MID(V17,6,1)","v":"4"},{"$f":"MID(D15,6,1)","v":{"$error":"#N/A"}},{"$f":"MID(D15,3,1)","v":{"$error":"#N/A"}},{"$f":"LEFT(D19,1)","v":"3"},{"$f":"MID(D15,5,1)","v":{"$error":"#N/A"}},{"$f":"MID(D15,2,1)","v":{"$error":"#N/A"}},{"$f":"RIGHT(V17,1)","v":"2"},{"$f":"MID(B6,2,1)","v":""},{"$f":"MID(B16*E19,4,1)","v":{"$error":"#N/A"}},{"$f":"MID(B19,2,1)","v":"0"},{"$f":"MID(B16*E19,1,1)","v":{"$error":"#N/A"}},{"$f":"MID(B6,8,1)","v":""},{"$f":"IF(ISNUMBER(MID(B16*E19,5,1)),MID(B16*E19,5,1),0)","v":0},{"$f":"MID(B6,6,1)","v":""},{"$f":"RIGHT(B19,1)","v":"1"},{"$f":"MID(B6,7,1)","v":""},{"$f":"RIGHT(B6,1)","v":""},{"$f":"MID(B15*E16,4,1)","v":{"$error":"#N/A"}},{"$f":"MID(V17,4,1)","v":"7"},{"$f":"RIGHT(C19,1)","v":"0"},{"$f":"LEFT(C19,1)","v":"1"},{"$f":"RIGHT(C16,1)","v":{"$error":"#N/A"}},{"$f":"MID(B15*E16,2,1)","v":{"$error":"#N/A"}},{"$f":"RIGHT(D19,1)","v":"1"},{"$f":"LEFT(C16,1)","v":{"$error":"#N/A"}},{"$f":"LEFT(D15,1)","v":{"$error":"#N/A"}}]
[null,null,null,null,null,null,null,null,null,null,null,null,{"$f":"RAND()","v":0.92885275783384857},{"$f":"RAND()","v":0.43220510389910405},0.65783843037509437,0.87973726924969675,0.85449287557832643,6.3817823375078797E-2,0.59316029958164085,0.74192613682222852,0.73124152202675263,0.66633205287998987,0.42067463610365274,9.8458719791003957E-2,0.79128772755264054,0.334314639881517,0.43655843631585123,0.85274026944127246,0.68994131680200133,0.18281386063586702,0.23567736421794894,0.37650733668150416,0.26073614959653602,0.66717303015885143,0.14275496051804393,0.38624806361058361,0.96309334658618873,0.74866690110960199,0.26732520206806265,9.1226244546126711E-2,0.22295693347637935,0.33652377865384175,0.42377541693052023,0.2126408732905164,0.18703152837525749,0.47508060996724355,5.616705854992099E-2,0.4169321141772212,0.63881955990662731,0.26310944944426995,0.17590702199234898,6.0803657244906106E-2,0.52711167303643625,4.8011561191469876E-2,0.78003620573264676,0.57799960319903509,0.29198859142443101,0.940706248058648,0.74284023542476352]
[null,null,null,null,null,null,null,null,null,null,null,null,{"$f":"IF(M30<0.5,VLOOKUP(M29*10+M30*20,$AG$2:$AH$27,2),M29)","v":""},{"$f":"IF(N30<0.5,VLOOKUP(N29*10+N30*20,$AG$2:$AH$27,2),N29)","v":{"$error":"#N/A"}},"",{"$error":"#N/A"},{"$error":"#N/A"},"U",{"$error":"#N/A"},"",{"$error":"#N/A"},"3",{"$error":"#VALUE!"},"G","2",{"$error":"#VALUE!"},"I",{"$error":"#N/A"},"3","N",{"$error":"#N/A"},{"$error":"#N/A"},"K","4",{"$error":"#N/A"},{"$error":"#N/A"},"3",{"$error":"#N/A"},{"$error":"#N/A"},"G",{"$error":"#VALUE!"},{"$error":"#N/A"},"C",{"$error":"#N/A"},{"$error":"#VALUE!"},"C",{"$error":"#VALUE!"},"F","",{"$error":"#VALUE!"},{"$error":"#N/A"},"U","0","D",{"$error":"#N/A"},{"$error":"#N/A"},"E",{"$error":"#N/A"},{"$error":"#N/A"}]
[null,null,null,null,null,null,null,null,null,null,null,null,{"$f":"CONCATENATE(M31,N31,O31,P31,Q31,R31,S31,T31,U31,V31,W31,X31,Y31,Z31,AA31,AB31,AC31,AD31,AE31,AF31,AG31,AH31,AI31,AJ31,AK31,AL31,AM31,AN31,AO31,AP31,AQ31,AR31,AS31,AT31,AU31,AV31,AW31,AX31,AY31,AZ31,BA31,BB31,BC31,BD31,BE31,BF31,BG31)","v":{"$error":"#N/A"}}]

{"sheet":"Existing Customer Claim","index":7,"n_rows":26,"n_cols":61,"rows_kept":26,"cut":false,"hidden":false,"merged":[]}
["Script:",null,null,null,null,null,null,null,null,null,null,null,null,null,null,null,null,null,null,null,null,null,null,null,null,null,null,null,null,null,null,null,null,null,null,null,null,null,null,null,null,null,null,null,null,null,null,null,null,null,null,null,null,null,null,null,null,null,null,"A",0]
[null,null,null,null,null,null,null,null,null,null,{"$f":"MID($B$6,COLUMN()-10,1)","v":""},{"$f":"MID($B$6,COLUMN()-10,1)","v":""},"","","","","","","","","","","","","","","","","","","","","","","","","","","","","","","","","","","","","","","","","","","","","",null,null,"B",0]
["\"Hello.  To whom do I have the pleasure of speaking?\"",null,null,null,null,null,null,null,null,null,{"$f":"IF(ISNUMBER(VALUE(K2)),K2,VLOOKUP(K2,$BH$1:$BI$26,2))","v":{"$error":"#N/A"}},{"$f":"IF(ISNUMBER(VALUE(L2)),L2,VLOOKUP(L2,$BH$1:$BI$26,2))","v":{"$error":"#N/A"}},{"$error":"#N/A"},{"$error":"#N/A"},{"$error":"#N/A"},{"$error":"#N/A"},{"$error":"#N/A"},{"$error":"#N/A"},{"$error":"#N/A"},{"$error":"#N/A"},{"$error":"#N/A"},{"$error":"#N/A"},{"$error":"#N/A"},{"$error":"#N/A"},{"$error":"#N/A"},{"$error":"#N/A"},{"$error":"#N/A"},{"$error":"#N/A"},{"$error":"#N/A"},{"$error":"#N/A"},{"$error":"#N/A"},{"$error":"#N/A"},{"$error":"#N/A"},{"$error":"#N/A"},{"$error":"#N/A"},{"$error":"#N/A"},{"$error":"#N/A"},{"$error":"#N/A"},{"$error":"#N/A"},{"$error":"#N/A"},{"$error":"#N/A"},{"$error":"#N/A"},{"$error":"#N/A"},{"$error":"#N/A"},{"$error":"#N/A"},{"$error":"#N/A"},{"$error":"#N/A"},{"$error":"#N/A"},{"$error":"#N/A"},{"$error":"#N/A"},{"$error":"#N/A"},{"$error":"#N/A"},{"$error":"#N/A"},{"$error":"#N/A"},{"$error":"#N/A"},{"$error":"#N/A"},{"$error":"#N/A"},null,null,"C",0]
["Response: ",null,null,null,null,null,null,null,null,null,null,null,null,null,null,null,null,null,null,null,null,null,null,null,null,null,null,null,null,null,null,null,null,null,null,null,null,null,null,null,null,null,null,null,null,null,null,null,null,null,null,null,null,null,null,null,null,null,null,"D",1]
["\"May I have your claim number?\"",null,null,null,null,null,null,null,null,null,"t5","p7","t1","d7","d2wc","r2","o3wo","t9","d1wc","r5","t4","c3","r7","t3","c1","d8","r3","r1","o1wo","p4","a1","r6","p6","p3","c7","p5","p2","r8","t2","d3wc","c2","d0wc","t8","d4wc","t6","c4","t7","t0","o4wo","r4","c6","c5","d6","o2wo","c8","d5","p1",null,null,"E",1]
["Reponse:",null,null,null,null,null,null,null,null,null,null,null,null,null,null,null,null,null,null,null,null,null,null,null,null,null,null,null,null,null,null,null,null,null,null,null,null,null,null,null,null,null,null,null,null,null,null,null,null,null,null,null,null,null,null,null,null,null,null,"F",1]
[{"$f":"CONCATENATE(\"I have your name as \",MID(B10,SEARCH(\" \",B10)+1,LEN(B10)-SEARCH(\" \",B10)),\" \",LEFT(B10,SEARCH(\" \",B10)-1),\", and your phone number as \",TEXT(B12,\"###-###-####\"),\". You had a concern with a \",F15,\" you ordered on \",N15, \",  \", P15, \" \", L15, \" for $\",G15,\", and your claim is being handled by \",B18,\".  How can I help you today?\")","v":{"$error":"#N/A"}},null,null,null,null,null,null,null,null,null,null,null,null,null,null,null,null,null,null,null,null,null,null,null,null,null,null,null,null,null,null,null,null,null,null,null,null,null,null,null,null,null,null,null,null,null,null,null,null,null,null,null,null,null,null,null,null,null,null,"G",2]
[null,null,null,null,null,null,null,null,null,null,null,null,null,null,null,null,null,null,null,null,null,null,null,null,null,null,null,null,null,null,null,null,null,null,null,null,null,null,null,null,null,null,null,null,null,null,null,null,null,null,null,null,null,null,null,null,null,null,null,"H",2]
[null,null,null,null,null,null,null,null,null,null,null,null,null,null,null,null,null,null,null,null,null,null,null,null,null,null,null,null,null,null,null,null,null,null,null,null,null,null,null,null,null,null,null,null,null,null,null,null,null,null,null,null,null,null,null,null,null,null,null,"I",2]
["Name:",{"$f":"VLOOKUP(B12,'Customer Information'!$A$2:$I$12,2)","v":{"$error":"#N/A"}},null,null,null,null,null,null,null,null,null,null,null,null,null,null,null,null,null,null,null,null,null,null,null,null,null,null,null,null,null,null,null,null,null,null,null,null,null,null,null,null,null,null,null,null,null,null,null,null,null,null,null,null,null,null,null,null,null,"J",3]
[null,null,null,null,null,null,null,null,null,null,null,null,null,null,null,null,null,null,null,null,null,null,null,null,null,null,null,null,null,null,null,null,null,null,null,null,null,null,null,null,null,null,null,null,null,null,null,null,null,null,null,null,null,null,null,null,null,null,null,"K",3]
["Phone:",{"$f":"VALUE(CONCATENATE(M3,AM3,X3,U3,K3,AS3,AU3,AQ3,R3,AV3))","v":{"$error":"#N/A"}},null,null,"Press Cntr-Shft-V to view customer data",null,null,null,null,null,null,null,null,null,null,null,null,null,null,null,null,null,null,null,null,null,null,null,null,null,null,null,null,null,null,null,null,null,null,null,null,null,null,null,null,null,null,null,null,null,null,null,null,null,null,null,null,null,null,"L",3]
["Email:",{"$f":"VLOOKUP(B12,'Customer Information'!$A$2:$I$12,3)","v":{"$error":"#N/A"}},null,null,"Press Cntr-Shft-P to protect cusomter data",null,null,null,null,null,null,null,null,null,null,null,null,null,null,null,null,null,null,null,null,null,null,null,null,null,null,null,null,null,null,null,null,null,null,null,null,null,null,null,null,null,null,null,null,null,null,null,null,null,null,null,null,null,null,"M",4]
[null,null,null,null,null,null,null,null,null,null,null,null,null,null,null,null,null,null,null,null,null,null,null,null,null,null,null,null,null,null,null,null,null,null,null,null,null,null,null,null,null,null,null,null,null,null,null,null,null,null,null,null,null,null,null,null,null,null,null,"N",4]
["Last Order:",{"$f":"VALUE(CONCATENATE(AC3,BB3,Q3,AW3)/M15)","v":{"$error":"#N/A"}},null,"Product:",{"$f":"VALUE(CONCATENATE(BE3,AK3,AH3,AD3,AJ3,AG3,N3))","v":{"$error":"#N/A"}},{"$f":"VLOOKUP(E15,'Product Information'!$A$14:$C$31,2)","v":{"$error":"#N/A"}},{"$f":"VLOOKUP(E15,'Product Information'!$A$14:$C$31,3)","v":{"$error":"#N/A"}},null,null,{"$f":"IF(VALUE(AR3)=0,VALUE(CONCATENATE(AP3,S3,O3,AN3))/M19,VALUE(CONCATENATE(AP3,S3,O3,AN3,AR3))/M19)","v":{"$error":"#N/A"}},{"$f":"CONCATENATE(BD3,BA3)","v":{"$error":"#N/A"}},{"$f":"CONCATENATE(N3,Z3)","v":{"$error":"#N/A"}},{"$f":"WEEKDAY(DATE(J15,K15,L15))","v":{"$error":"#N/A"}},{"$f":"VLOOKUP(M15,'Create Customer Claim'!$AC$2:$AD$8,2)","v":{"$error":"#N/A"}},null,{"$f":"VLOOKUP(VALUE(K15),'Create Customer Claim'!$V$2:$W$13,2)","v":{"$error":"#N/A"}},null,null,null,null,null,null,null,null,null,null,null,null,null,null,null,null,null,null,null,null,null,null,null,null,null,null,null,null,null,null,null,null,null,null,null,null,null,null,null,null,null,null,null,"O",4]
["Date:",{"$f":"CONCATENATE(N15,\", \",P15,\" \",L15,\", \",J15)","v":{"$error":"#N/A"}},null,null,null,null,null,null,null,null,null,null,null,null,null,null,null,null,null,null,null,null,null,null,null,null,null,null,null,null,null,null,null,null,null,null,null,null,null,null,null,null,null,null,null,null,null,null,null,null,null,null,null,null,null,null,null,null,null,"P",5]
[null,null,null,null,null,null,null,null,null,null,null,null,null,null,null,null,null,null,null,null,null,null,null,null,null,null,null,null,null,null,null,null,null,null,null,null,null,null,null,null,null,null,null,null,null,null,null,null,null,null,null,null,null,null,null,null,null,null,null,"Q",5]
["Assigned to:",{"$f":"VLOOKUP(VALUE(J18),'Create Customer Claim'!$Z$2:$AA$11,2)","v":{"$error":"#N/A"}},null,null,null,null,null,null,null,{"$f":"AE3","v":{"$error":"#N/A"}},null,null,null,null,null,null,null,null,null,null,null,null,null,null,null,null,null,null,null,null,null,null,null,null,null,null,null,null,null,null,null,null,null,null,null,null,null,null,null,null,null,null,null,null,null,null,null,null,null,"R",5]
["Claim Date: ",{"$f":"CONCATENATE(N19,\", \",K20,\" \",L19,\", \",J19)","v":{"$error":"#N/A"}},null,null,null,null,null,null,null,{"$f":"CONCATENATE(Y3,AO3,V3,AT3)","v":{"$error":"#N/A"}},{"$f":"CONCATENATE(AZ3,AY3)","v":{"$error":"#N/A"}},{"$f":"CONCATENATE(AI3,BC3)","v":{"$error":"#N/A"}},{"$f":"WEEKDAY(DATE(J19,K19,L19))","v":{"$error":"#N/A"}},{"$f":"VLOOKUP(M19,'Create Customer Claim'!$AC$2:$AD$8,2)","v":{"$error":"#N/A"}},null,null,null,null,null,null,null,null,null,null,null,null,null,null,null,null,null,null,null,null,null,null,null,null,null,null,null,null,null,null,null,null,null,null,null,null,null,null,null,null,null,null,null,null,null,"S",6]
[null,null,null,null,null,null,null,null,null,null,{"$f":"VLOOKUP(VALUE(K19),'Create Customer Claim'!$V$2:$W$13,2)","v":{"$error":"#N/A"}},null,null,null,null,null,null,null,null,null,null,null,null,null,null,null,null,null,null,null,null,null,null,null,null,null,null,null,null,null,null,null,null,null,null,null,null,null,null,null,null,null,null,null,null,null,null,null,null,"T",6]
[null,null,null,null,null,null,null,null,null,null,null,null,null,null,null,null,null,null,null,null,null,null,null,null,null,null,null,null,null,null,null,null,null,null,null,null,null,null,null,null,null,null,null,null,null,null,null,null,null,null,null,null,null,null,null,null,null,null,null,"U",7]
[null,null,null,null,null,null,null,null,null,null,null,null,null,null,null,null,null,null,null,null,null,null,null,null,null,null,null,null,null,null,null,null,null,null,null,null,null,null,null,null,null,null,null,null,null,null,null,null,null,null,null,null,null,null,null,null,null,null,null,"V",7]
[null,null,null,null,null,null,null,null,null,null,null,null,null,null,null,null,null,null,null,null,null,null,null,null,null,null,null,null,null,null,null,null,null,null,null,null,null,null,null,null,null,null,null,null,null,null,null,null,null,null,null,null,null,null,null,null,null,null,null,"W",8]
[null,null,null,null,null,null,null,null,null,null,null,null,null,null,null,null,null,null,null,null,null,null,null,null,null,null,null,null,null,null,null,null,null,null,null,null,null,null,null,null,null,null,null,null,null,null,null,null,null,null,null,null,null,null,null,null,null,null,null,"X",8]
[null,null,null,null,null,null,null,null,null,null,null,null,null,null,null,null,null,null,null,null,null,null,null,null,null,null,null,null,null,null,null,null,null,null,null,null,null,null,null,null,null,null,null,null,null,null,null,null,null,null,null,null,null,null,null,null,null,null,null,"Y",9]
[null,null,null,null,null,null,null,null,null,null,null,null,null,null,null,null,null,null,null,null,null,null,null,null,null,null,null,null,null,null,null,null,null,null,null,null,null,null,null,null,null,null,null,null,null,null,null,null,null,null,null,null,null,null,null,null,null,null,null,"Z",9]

{"sheet":"3056223185","index":8,"n_rows":80,"n_cols":7,"rows_kept":80,"cut":false,"hidden":true,"merged":[]}
["Name:",{"$f":"VLOOKUP(3056223185,'Customer Information'!$A$2:$I$12,2)","v":"Rhythm DJ"}]
["Phone:",{"$f":"TEXT(3056223185,\"###-###-####\")","v":"305-622-3185"}]
["Email:",{"$f":"VLOOKUP(3056223185,'Customer Information'!$A$2:$I$12,3)","v":"Tunes@yahoo.com"}]
["Address:",{"$f":"CONCATENATE(VLOOKUP(3056223185,'Customer Information'!$A$2:$I$12,4),\", \",VLOOKUP(3056223185,'Customer Information'!$A$2:$I$12,5),\", \",VLOOKUP(3056223185,'Customer Information'!$A$2:$I$12,6),\" \",VLOOKUP(3056223185,'Customer Information'!$A$2:$I$12,7))","v":"123 Counting Street, Numbers, OK 97365"}]
["Customer Since:",{"$f":"VLOOKUP(3056223185,'Customer Information'!$A$2:$I$12,8)","v":2007}]
["Good Standing:",{"$f":"VLOOKUP(3056223185,'Customer Information'!$A$2:$I$12,9)","v":"No"}]
[{"$f":"CONCATENATE(A8,A9,A10,A11,A12,A13,A14,A15,A16,A17,A18,A19,A20,A21,A22,A23,A24,A25,A26,A27,A28,A29,A30,A31,A32,A33,A34,A35,A36)","v":"1016"},"Order Number"]
[{"$f":"IF('Input Calculation'!B2=3056223185,'Input Calculation'!A2,\"\")","v":""},{"$f":"MID($A$7,ROW()-7,4)","v":"1016"},{"$f":"IFERROR(VLOOKUP(VALUE($B$8),'Input Calculation'!$A$2:$AJ$29,9),\"\")","v":4989600},{"$f":"_xlfn.IFNA(VLOOKUP($C8,'Product Information'!$A$2:$C$31,2),\"\")","v":"Hard Hat"},{"$f":"_xlfn.IFNA(VLOOKUP($C8,'Product Information'!$A$2:$C$31,3),\"\")","v":29.99}]
[{"$f":"IF('Input Calculation'!B3=3056223185,'Input Calculation'!A3,\"\")","v":""},null,{"$f":"IFERROR(VLOOKUP(VALUE($B$8),'Input Calculation'!$A$2:$AJ$29,11),\"\")","v":3055845},{"$f":"_xlfn.IFNA(VLOOKUP($C9,'Product Information'!$A$2:$C$31,2),\"\")","v":"Winter Jacket"},{"$f":"_xlfn.IFNA(VLOOKUP($C9,'Product Information'!$A$2:$C$31,3),\"\")","v":199.99}]
[{"$f":"IF('Input Calculation'!B4=3056223185,'Input Calculation'!A4,\"\")","v":""},null,{"$f":"IFERROR(VLOOKUP(VALUE($B$8),'Input Calculation'!$A$2:$AJ$29,13),\"\")","v":""},{"$f":"_xlfn.IFNA(VLOOKUP($C10,'Product Information'!$A$2:$C$31,2),\"\")","v":""},{"$f":"_xlfn.IFNA(VLOOKUP($C10,'Product Information'!$A$2:$C$31,3),\"\")","v":""}]
[{"$f":"IF('Input Calculation'!B5=3056223185,'Input Calculation'!A5,\"\")","v":""},null,{"$f":"IFERROR(VLOOKUP(VALUE($B$8),'Input Calculation'!$A$2:$AJ$29,15),\"\")","v":""},{"$f":"_xlfn.IFNA(VLOOKUP($C11,'Product Information'!$A$2:$C$31,2),\"\")","v":""},{"$f":"_xlfn.IFNA(VLOOKUP($C11,'Product Information'!$A$2:$C$31,3),\"\")","v":""}]
[{"$f":"IF('Input Calculation'!B6=3056223185,'Input Calculation'!A6,\"\")","v":""},null,{"$f":"IFERROR(VLOOKUP(VALUE($B$8),'Input Calculation'!$A$2:$AJ$29,17),\"\")","v":""},{"$f":"_xlfn.IFNA(VLOOKUP($C12,'Product Information'!$A$2:$C$31,2),\"\")","v":""},{"$f":"_xlfn.IFNA(VLOOKUP($C12,'Product Information'!$A$2:$C$31,3),\"\")","v":""}]
[{"$f":"IF('Input Calculation'!B7=3056223185,'Input Calculation'!A7,\"\")","v":""},null,{"$f":"IFERROR(VLOOKUP(VALUE($B$8),'Input Calculation'!$A$2:$AJ$29,19),\"\")","v":""},{"$f":"_xlfn.IFNA(VLOOKUP($C13,'Product Information'!$A$2:$C$31,2),\"\")","v":""},{"$f":"_xlfn.IFNA(VLOOKUP($C13,'Product Information'!$A$2:$C$31,3),\"\")","v":""}]
[{"$f":"IF('Input Calculation'!B8=3056223185,'Input Calculation'!A8,\"\")","v":""},null,{"$f":"IFERROR(VLOOKUP(VALUE($B$8),'Input Calculation'!$A$2:$AJ$29,21),\"\")","v":""},{"$f":"_xlfn.IFNA(VLOOKUP($C14,'Product Information'!$A$2:$C$31,2),\"\")","v":""},{"$f":"_xlfn.IFNA(VLOOKUP($C14,'Product Information'!$A$2:$C$31,3),\"\")","v":""}]
[{"$f":"IF('Input Calculation'!B9=3056223185,'Input Calculation'!A9,\"\")","v":""},null,{"$f":"IFERROR(VLOOKUP(VALUE($B$8),'Input Calculation'!$A$2:$AJ$29,23),\"\")","v":""},{"$f":"_xlfn.IFNA(VLOOKUP($C15,'Product Information'!$A$2:$C$31,2),\"\")","v":""},{"$f":"_xlfn.IFNA(VLOOKUP($C15,'Product Information'!$A$2:$C$31,3),\"\")","v":""}]
[{"$f":"IF('Input Calculation'!B10=3056223185,'Input Calculation'!A10,\"\")","v":""},null,{"$f":"IFERROR(VLOOKUP(VALUE($B$8),'Input Calculation'!$A$2:$AJ$29,25),\"\")","v":""},{"$f":"_xlfn.IFNA(VLOOKUP($C16,'Product Information'!$A$2:$C$31,2),\"\")","v":""},{"$f":"_xlfn.IFNA(VLOOKUP($C16,'Product Information'!$A$2:$C$31,3),\"\")","v":""}]
[{"$f":"IF('Input Calculation'!B11=3056223185,'Input Calculation'!A11,\"\")","v":""},null,{"$f":"IFERROR(VLOOKUP(VALUE($B$8),'Input Calculation'!$A$2:$AJ$29,27),\"\")","v":""},{"$f":"_xlfn.IFNA(VLOOKUP($C17,'Product Information'!$A$2:$C$31,2),\"\")","v":""},{"$f":"_xlfn.IFNA(VLOOKUP($C17,'Product Information'!$A$2:$C$31,3),\"\")","v":""}]
[{"$f":"IF('Input Calculation'!B12=3056223185,'Input Calculation'!A12,\"\")","v":""},null,null,"Total:",{"$f":"VLOOKUP(VALUE($B$8),'Input Calculation'!$A$2:$AJ$29,36)","v":221.58},"Notes: ","Payment was fraudulent"]
[{"$f":"IF('Input Calculation'!B13=3056223185,'Input Calculation'!A13,\"\")","v":""}]
[{"$f":"IF('Input Calculation'!B14=3056223185,'Input Calculation'!A14,\"\")","v":""},{"$f":"MID($A$7,LEN(B8)+1,4)","v":""},{"$f":"IFERROR(VLOOKUP(VALUE($B$20),'Input Calculation'!$A$2:$AJ$29,9),\"\")","v":""},{"$f":"_xlfn.IFNA(VLOOKUP($C20,'Product Information'!$A$2:$C$31,2),\"\")","v":""},{"$f":"_xlfn.IFNA(VLOOKUP($C20,'Product Information'!$A$2:$C$31,3),\"\")","v":""}]
[{"$f":"IF('Input Calculation'!B15=3056223185,'Input Calculation'!A15,\"\")","v":""},null,{"$f":"IFERROR(VLOOKUP(VALUE($B$20),'Input Calculation'!$A$2:$AJ$29,11),\"\")","v":""},{"$f":"_xlfn.IFNA(VLOOKUP($C21,'Product Information'!$A$2:$C$31,2),\"\")","v":""},{"$f":"_xlfn.IFNA(VLOOKUP($C21,'Product Information'!$A$2:$C$31,3),\"\")","v":""}]
[{"$f":"IF('Input Calculation'!B16=3056223185,'Input Calculation'!A16,\"\")","v":""},null,{"$f":"IFERROR(VLOOKUP(VALUE($B$20),'Input Calculation'!$A$2:$AJ$29,13),\"\")","v":""},{"$f":"_xlfn.IFNA(VLOOKUP($C22,'Product Information'!$A$2:$C$31,2),\"\")","v":""},{"$f":"_xlfn.IFNA(VLOOKUP($C22,'Product Information'!$A$2:$C$31,3),\"\")","v":""}]
[{"$f":"IF('Input Calculation'!B17=3056223185,'Input Calculation'!A17,\"\")","v":1016},null,{"$f":"IFERROR(VLOOKUP(VALUE($B$20),'Input Calculation'!$A$2:$AJ$29,15),\"\")","v":""},{"$f":"_xlfn.IFNA(VLOOKUP($C23,'Product Information'!$A$2:$C$31,2),\"\")","v":""},{"$f":"_xlfn.IFNA(VLOOKUP($C23,'Product Information'!$A$2:$C$31,3),\"\")","v":""}]
[{"$f":"IF('Input Calculation'!B18=3056223185,'Input Calculation'!A18,\"\")","v":""},null,{"$f":"IFERROR(VLOOKUP(VALUE($B$20),'Input Calculation'!$A$2:$AJ$29,17),\"\")","v":""},{"$f":"_xlfn.IFNA(VLOOKUP($C24,'Product Information'!$A$2:$C$31,2),\"\")","v":""},{"$f":"_xlfn.IFNA(VLOOKUP($C24,'Product Information'!$A$2:$C$31,3),\"\")","v":""}]
[{"$f":"IF('Input Calculation'!B19=3056223185,'Input Calculation'!A19,\"\")","v":""},null,{"$f":"IFERROR(VLOOKUP(VALUE($B$20),'Input Calculation'!$A$2:$AJ$29,19),\"\")","v":""},{"$f":"_xlfn.IFNA(VLOOKUP($C25,'Product Information'!$A$2:$C$31,2),\"\")","v":""},{"$f":"_xlfn.IFNA(VLOOKUP($C25,'Product Information'!$A$2:$C$31,3),\"\")","v":""}]
[{"$f":"IF('Input Calculation'!B20=3056223185,'Input Calculation'!A20,\"\")","v":""},null,{"$f":"IFERROR(VLOOKUP(VALUE($B$20),'Input Calculation'!$A$2:$AJ$29,21),\"\")","v":""},{"$f":"_xlfn.IFNA(VLOOKUP($C26,'Product Information'!$A$2:$C$31,2),\"\")","v":""},{"$f":"_xlfn.IFNA(VLOOKUP($C26,'Product Information'!$A$2:$C$31,3),\"\")","v":""}]
[{"$f":"IF('Input Calculation'!B21=3056223185,'Input Calculation'!A21,\"\")","v":""},null,{"$f":"IFERROR(VLOOKUP(VALUE($B$20),'Input Calculation'!$A$2:$AJ$29,23),\"\")","v":""},{"$f":"_xlfn.IFNA(VLOOKUP($C27,'Product Information'!$A$2:$C$31,2),\"\")","v":""},{"$f":"_xlfn.IFNA(VLOOKUP($C27,'Product Information'!$A$2:$C$31,3),\"\")","v":""}]
[{"$f":"IF('Input Calculation'!B22=3056223185,'Input Calculation'!A22,\"\")","v":""},null,{"$f":"IFERROR(VLOOKUP(VALUE($B$20),'Input Calculation'!$A$2:$AJ$29,25),\"\")","v":""},{"$f":"_xlfn.IFNA(VLOOKUP($C28,'Product Information'!$A$2:$C$31,2),\"\")","v":""},{"$f":"_xlfn.IFNA(VLOOKUP($C28,'Product Information'!$A$2:$C$31,3),\"\")","v":""}]
[{"$f":"IF('Input Calculation'!B23=3056223185,'Input Calculation'!A23,\"\")","v":""},null,{"$f":"IFERROR(VLOOKUP(VALUE($B$20),'Input Calculation'!$A$2:$AJ$29,27),\"\")","v":""},{"$f":"_xlfn.IFNA(VLOOKUP($C29,'Product Information'!$A$2:$C$31,2),\"\")","v":""},{"$f":"_xlfn.IFNA(VLOOKUP($C29,'Product Information'!$A$2:$C$31,3),\"\")","v":""}]
[{"$f":"IF('Input Calculation'!B24=3056223185,'Input Calculation'!A24,\"\")","v":""},null,null,"Total:",{"$f":"IFERROR(VLOOKUP(VALUE($B$20),'Input Calculation'!$A$2:$AJ$29,36),\"\")","v":""},"Notes: "]
[{"$f":"IF('Input Calculation'!B25=3056223185,'Input Calculation'!A25,\"\")","v":""}]
[{"$f":"IF('Input Calculation'!B26=3056223185,'Input Calculation'!A26,\"\")","v":""},{"$f":"MID($A$7,LEN(B8)+LEN(B20)+1,4)","v":""},{"$f":"IFERROR(VLOOKUP(VALUE($B$32),'Input Calculation'!$A$2:$AJ$29,9),\"\")","v":""},{"$f":"_xlfn.IFNA(VLOOKUP($C32,'Product Information'!$A$2:$C$31,2),\"\")","v":""},{"$f":"_xlfn.IFNA(VLOOKUP($C32,'Product Information'!$A$2:$C$31,3),\"\")","v":""}]
[{"$f":"IF('Input Calculation'!B27=3056223185,'Input Calculation'!A27,\"\")","v":""},null,{"$f":"IFERROR(VLOOKUP(VALUE($B$32),'Input Calculation'!$A$2:$AJ$29,11),\"\")","v":""},{"$f":"_xlfn.IFNA(VLOOKUP($C33,'Product Information'!$A$2:$C$31,2),\"\")","v":""},{"$f":"_xlfn.IFNA(VLOOKUP($C33,'Product Information'!$A$2:$C$31,3),\"\")","v":""}]
[{"$f":"IF('Input Calculation'!B28=3056223185,'Input Calculation'!A28,\"\")","v":""},null,{"$f":"IFERROR(VLOOKUP(VALUE($B$32),'Input Calculation'!$A$2:$AJ$29,13),\"\")","v":""},{"$f":"_xlfn.IFNA(VLOOKUP($C34,'Product Information'!$A$2:$C$31,2),\"\")","v":""},{"$f":"_xlfn.IFNA(VLOOKUP($C34,'Product Information'!$A$2:$C$31,3),\"\")","v":""}]
[{"$f":"IF('Input Calculation'!B29=3056223185,'Input Calculation'!A29,\"\")","v":""},null,{"$f":"IFERROR(VLOOKUP(VALUE($B$32),'Input Calculation'!$A$2:$AJ$29,15),\"\")","v":""},{"$f":"_xlfn.IFNA(VLOOKUP($C35,'Product Information'!$A$2:$C$31,2),\"\")","v":""},{"$f":"_xlfn.IFNA(VLOOKUP($C35,'Product Information'!$A$2:$C$31,3),\"\")","v":""}]
[{"$f":"IF('Input Calculation'!B30=3056223185,'Input Calculation'!A30,\"\")","v":""},null,{"$f":"IFERROR(VLOOKUP(VALUE($B$32),'Input Calculation'!$A$2:$AJ$29,17),\"\")","v":""},{"$f":"_xlfn.IFNA(VLOOKUP($C36,'Product Information'!$A$2:$C$31,2),\"\")","v":""},{"$f":"_xlfn.IFNA(VLOOKUP($C36,'Product Information'!$A$2:$C$31,3),\"\")","v":""}]
[null,null,{"$f":"IFERROR(VLOOKUP(VALUE($B$32),'Input Calculation'!$A$2:$AJ$29,19),\"\")","v":""},{"$f":"_xlfn.IFNA(VLOOKUP($C37,'Product Information'!$A$2:$C$31,2),\"\")","v":""},{"$f":"_xlfn.IFNA(VLOOKUP($C37,'Product Information'!$A$2:$C$31,3),\"\")","v":""}]
[null,null,{"$f":"IFERROR(VLOOKUP(VALUE($B$32),'Input Calculation'!$A$2:$AJ$29,21),\"\")","v":""},{"$f":"_xlfn.IFNA(VLOOKUP($C38,'Product Information'!$A$2:$C$31,2),\"\")","v":""},{"$f":"_xlfn.IFNA(VLOOKUP($C38,'Product Information'!$A$2:$C$31,3),\"\")","v":""}]
[null,null,{"$f":"IFERROR(VLOOKUP(VALUE($B$32),'Input Calculation'!$A$2:$AJ$29,23),\"\")","v":""},{"$f":"_xlfn.IFNA(VLOOKUP($C39,'Product Information'!$A$2:$C$31,2),\"\")","v":""},{"$f":"_xlfn.IFNA(VLOOKUP($C39,'Product Information'!$A$2:$C$31,3),\"\")","v":""}]
[null,null,{"$f":"IFERROR(VLOOKUP(VALUE($B$32),'Input Calculation'!$A$2:$AJ$29,25),\"\")","v":""},{"$f":"_xlfn.IFNA(VLOOKUP($C40,'Product Information'!$A$2:$C$31,2),\"\")","v":""},{"$f":"_xlfn.IFNA(VLOOKUP($C40,'Product Information'!$A$2:$C$31,3),\"\")","v":""}]
[null,null,{"$f":"IFERROR(VLOOKUP(VALUE($B$32),'Input Calculation'!$A$2:$AJ$29,27),\"\")","v":""},{"$f":"_xlfn.IFNA(VLOOKUP($C41,'Product Information'!$A$2:$C$31,2),\"\")","v":""},{"$f":"_xlfn.IFNA(VLOOKUP($C41,'Product Information'!$A$2:$C$31,3),\"\")","v":""}]
[null,null,null,"Total:",{"$f":"IFERROR(VLOOKUP(VALUE($B$32),'Input Calculation'!$A$2:$AJ$29,36),\"\")","v":""},"Notes: "]
[]
[null,{"$f":"MID($A$7,LEN(B8)+LEN(B20)+LEN(B32)+1,4)","v":""},{"$f":"IFERROR(VLOOKUP(VALUE($B$44),'Input Calculation'!$A$2:$AJ$29,9),\"\")","v":""},{"$f":"_xlfn.IFNA(VLOOKUP($C44,'Product Information'!$A$2:$C$31,2),\"\")","v":""},{"$f":"_xlfn.IFNA(VLOOKUP($C44,'Product Information'!$A$2:$C$31,3),\"\")","v":""}]
[null,null,{"$f":"IFERROR(VLOOKUP(VALUE($B$45),'Input Calculation'!$A$2:$AJ$29,11),\"\")","v":""},{"$f":"_xlfn.IFNA(VLOOKUP($C45,'Product Information'!$A$2:$C$31,2),\"\")","v":""},{"$f":"_xlfn.IFNA(VLOOKUP($C45,'Product Information'!$A$2:$C$31,3),\"\")","v":""}]
[null,null,{"$f":"IFERROR(VLOOKUP(VALUE($B$46),'Input Calculation'!$A$2:$AJ$29,13),\"\")","v":""},{"$f":"_xlfn.IFNA(VLOOKUP($C46,'Product Information'!$A$2:$C$31,2),\"\")","v":""},{"$f":"_xlfn.IFNA(VLOOKUP($C46,'Product Information'!$A$2:$C$31,3),\"\")","v":""}]
[null,null,{"$f":"IFERROR(VLOOKUP(VALUE($B$46),'Input Calculation'!$A$2:$AJ$29,15),\"\")","v":""},{"$f":"_xlfn.IFNA(VLOOKUP($C47,'Product Information'!$A$2:$C$31,2),\"\")","v":""},{"$f":"_xlfn.IFNA(VLOOKUP($C47,'Product Information'!$A$2:$C$31,3),\"\")","v":""}]
[null,null,{"$f":"IFERROR(VLOOKUP(VALUE($B$46),'Input Calculation'!$A$2:$AJ$29,17),\"\")","v":""},{"$f":"_xlfn.IFNA(VLOOKUP($C48,'Product Information'!$A$2:$C$31,2),\"\")","v":""},{"$f":"_xlfn.IFNA(VLOOKUP($C48,'Product Information'!$A$2:$C$31,3),\"\")","v":""}]
[null,null,{"$f":"IFERROR(VLOOKUP(VALUE($B$46),'Input Calculation'!$A$2:$AJ$29,19),\"\")","v":""},{"$f":"_xlfn.IFNA(VLOOKUP($C49,'Product Information'!$A$2:$C$31,2),\"\")","v":""},{"$f":"_xlfn.IFNA(VLOOKUP($C49,'Product Information'!$A$2:$C$31,3),\"\")","v":""}]
[null,null,{"$f":"IFERROR(VLOOKUP(VALUE($B$46),'Input Calculation'!$A$2:$AJ$29,21),\"\")","v":""},{"$f":"_xlfn.IFNA(VLOOKUP($C50,'Product Information'!$A$2:$C$31,2),\"\")","v":""},{"$f":"_xlfn.IFNA(VLOOKUP($C50,'Product Information'!$A$2:$C$31,3),\"\")","v":""}]
[null,null,{"$f":"IFERROR(VLOOKUP(VALUE($B$46),'Input Calculation'!$A$2:$AJ$29,23),\"\")","v":""},{"$f":"_xlfn.IFNA(VLOOKUP($C51,'Product Information'!$A$2:$C$31,2),\"\")","v":""},{"$f":"_xlfn.IFNA(VLOOKUP($C51,'Product Information'!$A$2:$C$31,3),\"\")","v":""}]
[null,null,{"$f":"IFERROR(VLOOKUP(VALUE($B$46),'Input Calculation'!$A$2:$AJ$29,25),\"\")","v":""},{"$f":"_xlfn.IFNA(VLOOKUP($C52,'Product Information'!$A$2:$C$31,2),\"\")","v":""},{"$f":"_xlfn.IFNA(VLOOKUP($C52,'Product Information'!$A$2:$C$31,3),\"\")","v":""}]
[null,null,{"$f":"IFERROR(VLOOKUP(VALUE($B$46),'Input Calculation'!$A$2:$AJ$29,27),\"\")","v":""},{"$f":"_xlfn.IFNA(VLOOKUP($C53,'Product Information'!$A$2:$C$31,2),\"\")","v":""},{"$f":"_xlfn.IFNA(VLOOKUP($C53,'Product Information'!$A$2:$C$31,3),\"\")","v":""}]
[null,null,null,"Total:",{"$f":"IFERROR(VLOOKUP(VALUE($B$46),'Input Calculation'!$A$2:$AJ$29,36),\"\")","v":""},"Notes: "]
[]
[null,{"$f":"MID($A$7,LEN(B8)+LEN(B20)+LEN(B32)+LEN(B46)+1,4)","v":""},{"$f":"IFERROR(VLOOKUP(VALUE($B$56),'Input Calculation'!$A$2:$AJ$29,9),\"\")","v":""},{"$f":"_xlfn.IFNA(VLOOKUP($C56,'Product Information'!$A$2:$C$31,2),\"\")","v":""},{"$f":"_xlfn.IFNA(VLOOKUP($C56,'Product Information'!$A$2:$C$31,3),\"\")","v":""}]
[null,null,{"$f":"IFERROR(VLOOKUP(VALUE($B$56),'Input Calculation'!$A$2:$AJ$29,11),\"\")","v":""},{"$f":"_xlfn.IFNA(VLOOKUP($C57,'Product Information'!$A$2:$C$31,2),\"\")","v":""},{"$f":"_xlfn.IFNA(VLOOKUP($C57,'Product Information'!$A$2:$C$31,3),\"\")","v":""}]
[null,null,{"$f":"IFERROR(VLOOKUP(VALUE($B$56),'Input Calculation'!$A$2:$AJ$29,13),\"\")","v":""},{"$f":"_xlfn.IFNA(VLOOKUP($C58,'Product Information'!$A$2:$C$31,2),\"\")","v":""},{"$f":"_xlfn.IFNA(VLOOKUP($C58,'Product Information'!$A$2:$C$31,3),\"\")","v":""}]
[null,null,{"$f":"IFERROR(VLOOKUP(VALUE($B$56),'Input Calculation'!$A$2:$AJ$29,15),\"\")","v":""},{"$f":"_xlfn.IFNA(VLOOKUP($C59,'Product Information'!$A$2:$C$31,2),\"\")","v":""},{"$f":"_xlfn.IFNA(VLOOKUP($C59,'Product Information'!$A$2:$C$31,3),\"\")","v":""}]
[null,null,{"$f":"IFERROR(VLOOKUP(VALUE($B$56),'Input Calculation'!$A$2:$AJ$29,17),\"\")","v":""},{"$f":"_xlfn.IFNA(VLOOKUP($C60,'Product Information'!$A$2:$C$31,2),\"\")","v":""},{"$f":"_xlfn.IFNA(VLOOKUP($C60,'Product Information'!$A$2:$C$31,3),\"\")","v":""}]
[null,null,{"$f":"IFERROR(VLOOKUP(VALUE($B$56),'Input Calculation'!$A$2:$AJ$29,19),\"\")","v":""},{"$f":"_xlfn.IFNA(VLOOKUP($C61,'Product Information'!$A$2:$C$31,2),\"\")","v":""},{"$f":"_xlfn.IFNA(VLOOKUP($C61,'Product Information'!$A$2:$C$31,3),\"\")","v":""}]
[null,null,{"$f":"IFERROR(VLOOKUP(VALUE($B$56),'Input Calculation'!$A$2:$AJ$29,21),\"\")","v":""},{"$f":"_xlfn.IFNA(VLOOKUP($C62,'Product Information'!$A$2:$C$31,2),\"\")","v":""},{"$f":"_xlfn.IFNA(VLOOKUP($C62,'Product Information'!$A$2:$C$31,3),\"\")","v":""}]
[null,null,{"$f":"IFERROR(VLOOKUP(VALUE($B$56),'Input Calculation'!$A$2:$AJ$29,23),\"\")","v":""},{"$f":"_xlfn.IFNA(VLOOKUP($C63,'Product Information'!$A$2:$C$31,2),\"\")","v":""},{"$f":"_xlfn.IFNA(VLOOKUP($C63,'Product Information'!$A$2:$C$31,3),\"\")","v":""}]
[null,null,{"$f":"IFERROR(VLOOKUP(VALUE($B$56),'Input Calculation'!$A$2:$AJ$29,25),\"\")","v":""},{"$f":"_xlfn.IFNA(VLOOKUP($C64,'Product Information'!$A$2:$C$31,2),\"\")","v":""},{"$f":"_xlfn.IFNA(VLOOKUP($C64,'Product Information'!$A$2:$C$31,3),\"\")","v":""}]
[null,null,{"$f":"IFERROR(VLOOKUP(VALUE($B$56),'Input Calculation'!$A$2:$AJ$29,27),\"\")","v":""},{"$f":"_xlfn.IFNA(VLOOKUP($C65,'Product Information'!$A$2:$C$31,2),\"\")","v":""},{"$f":"_xlfn.IFNA(VLOOKUP($C65,'Product Information'!$A$2:$C$31,3),\"\")","v":""}]
[null,null,null,"Total:",{"$f":"IFERROR(VLOOKUP(VALUE($B$56),'Input Calculation'!$A$2:$AJ$29,36),\"\")","v":""},"Notes: "]
[null,{"$f":"MID($A$7,4*(ROW()-7),4)","v":""}]
[null,{"$f":"MID($A$7,LEN(B8)+LEN(B20)+LEN(B32)+LEN(B46)+LEN(B56)+1,4)","v":""},{"$f":"IFERROR(VLOOKUP(VALUE($B$68),'Input Calculation'!$A$2:$AJ$29,9),\"\")","v":""},{"$f":"_xlfn.IFNA(VLOOKUP($C68,'Product Information'!$A$2:$C$31,2),\"\")","v":""},{"$f":"_xlfn.IFNA(VLOOKUP($C68,'Product Information'!$A$2:$C$31,3),\"\")","v":""}]
[null,null,{"$f":"IFERROR(VLOOKUP(VALUE($B$68),'Input Calculation'!$A$2:$AJ$29,11),\"\")","v":""},{"$f":"_xlfn.IFNA(VLOOKUP($C69,'Product Information'!$A$2:$C$31,2),\"\")","v":""},{"$f":"_xlfn.IFNA(VLOOKUP($C69,'Product Information'!$A$2:$C$31,3),\"\")","v":""}]
[null,null,{"$f":"IFERROR(VLOOKUP(VALUE($B$68),'Input Calculation'!$A$2:$AJ$29,13),\"\")","v":""},{"$f":"_xlfn.IFNA(VLOOKUP($C70,'Product Information'!$A$2:$C$31,2),\"\")","v":""},{"$f":"_xlfn.IFNA(VLOOKUP($C70,'Product Information'!$A$2:$C$31,3),\"\")","v":""}]
[null,null,{"$f":"IFERROR(VLOOKUP(VALUE($B$68),'Input Calculation'!$A$2:$AJ$29,15),\"\")","v":""},{"$f":"_xlfn.IFNA(VLOOKUP($C71,'Product Information'!$A$2:$C$31,2),\"\")","v":""},{"$f":"_xlfn.IFNA(VLOOKUP($C71,'Product Information'!$A$2:$C$31,3),\"\")","v":""}]
[null,null,{"$f":"IFERROR(VLOOKUP(VALUE($B$68),'Input Calculation'!$A$2:$AJ$29,17),\"\")","v":""},{"$f":"_xlfn.IFNA(VLOOKUP($C72,'Product Information'!$A$2:$C$31,2),\"\")","v":""},{"$f":"_xlfn.IFNA(VLOOKUP($C72,'Product Information'!$A$2:$C$31,3),\"\")","v":""}]
[null,null,{"$f":"IFERROR(VLOOKUP(VALUE($B$68),'Input Calculation'!$A$2:$AJ$29,19),\"\")","v":""},{"$f":"_xlfn.IFNA(VLOOKUP($C73,'Product Information'!$A$2:$C$31,2),\"\")","v":""},{"$f":"_xlfn.IFNA(VLOOKUP($C73,'Product Information'!$A$2:$C$31,3),\"\")","v":""}]
[null,null,{"$f":"IFERROR(VLOOKUP(VALUE($B$68),'Input Calculation'!$A$2:$AJ$29,21),\"\")","v":""},{"$f":"_xlfn.IFNA(VLOOKUP($C74,'Product Information'!$A$2:$C$31,2),\"\")","v":""},{"$f":"_xlfn.IFNA(VLOOKUP($C74,'Product Information'!$A$2:$C$31,3),\"\")","v":""}]
[null,null,{"$f":"IFERROR(VLOOKUP(VALUE($B$68),'Input Calculation'!$A$2:$AJ$29,23),\"\")","v":""},{"$f":"_xlfn.IFNA(VLOOKUP($C75,'Product Information'!$A$2:$C$31,2),\"\")","v":""},{"$f":"_xlfn.IFNA(VLOOKUP($C75,'Product Information'!$A$2:$C$31,3),\"\")","v":""}]
[null,null,{"$f":"IFERROR(VLOOKUP(VALUE($B$68),'Input Calculation'!$A$2:$AJ$29,25),\"\")","v":""},{"$f":"_xlfn.IFNA(VLOOKUP($C76,'Product Information'!$A$2:$C$31,2),\"\")","v":""},{"$f":"_xlfn.IFNA(VLOOKUP($C76,'Product Information'!$A$2:$C$31,3),\"\")","v":""}]
[null,null,{"$f":"IFERROR(VLOOKUP(VALUE($B$68),'Input Calculation'!$A$2:$AJ$29,27),\"\")","v":""},{"$f":"_xlfn.IFNA(VLOOKUP($C77,'Product Information'!$A$2:$C$31,2),\"\")","v":""},{"$f":"_xlfn.IFNA(VLOOKUP($C77,'Product Information'!$A$2:$C$31,3),\"\")","v":""}]
[null,null,null,"Total:",{"$f":"IFERROR(VLOOKUP(VALUE($B$68),'Input Calculation'!$A$2:$AJ$29,36),\"\")","v":""},"Notes: "]
[null,{"$f":"MID($A$7,4*(ROW()-7),4)","v":""}]
[null,{"$f":"MID($A$7,4*(ROW()-7),4)","v":""}]

{"sheet":"4438641204","index":9,"n_rows":80,"n_cols":6,"rows_kept":80,"cut":false,"hidden":true,"merged":[]}
["Name:",{"$f":"VLOOKUP(4438641204,'Customer Information'!$A$2:$I$12,2)","v":"Calendar Marie"}]
["Phone:",{"$f":"TEXT(4438641204,\"###-###-####\")","v":"443-864-1204"}]
["Email:",{"$f":"VLOOKUP(4438641204,'Customer Information'!$A$2:$I$12,3)","v":"pies4life@gmail.com"}]
["Address:",{"$f":"CONCATENATE(VLOOKUP(4438641204,'Customer Information'!$A$2:$I$12,4),\", \",VLOOKUP(4438641204,'Customer Information'!$A$2:$I$12,5),\", \",VLOOKUP(4438641204,'Customer Information'!$A$2:$I$12,6),\" \",VLOOKUP(4438641204,'Customer Information'!$A$2:$I$12,7))","v":"3343 Rhubarb Road, Jacksonville, MI 30243"}]
["Customer Since:",{"$f":"VLOOKUP(4438641204,'Customer Information'!$A$2:$I$12,8)","v":2021}]
["Good Standing:",{"$f":"VLOOKUP(4438641204,'Customer Information'!$A$2:$I$12,9)","v":"Yes"}]
[{"$f":"CONCATENATE(A8,A9,A10,A11,A12,A13,A14,A15,A16,A17,A18,A19,A20,A21,A22,A23,A24,A25,A26,A27,A28,A29,A30,A31,A32,A33,A34,A35,A36)","v":"1011"},"Order Number"]
[{"$f":"IF('Input Calculation'!B2=4438641204,'Input Calculation'!A2,\"\")","v":""},{"$f":"MID($A$7,ROW()-7,4)","v":"1011"},{"$f":"IFERROR(VLOOKUP(VALUE($B$8),'Input Calculation'!$A$2:$AJ$29,9),\"\")","v":5216388},{"$f":"_xlfn.IFNA(VLOOKUP($C8,'Product Information'!$A$2:$C$31,2),\"\")","v":"Logo Hat"},{"$f":"_xlfn.IFNA(VLOOKUP($C8,'Product Information'!$A$2:$C$31,3),\"\")","v":49.99}]
[{"$f":"IF('Input Calculation'!B3=4438641204,'Input Calculation'!A3,\"\")","v":""},null,{"$f":"IFERROR(VLOOKUP(VALUE($B$8),'Input Calculation'!$A$2:$AJ$29,11),\"\")","v":7250412},{"$f":"_xlfn.IFNA(VLOOKUP($C9,'Product Information'!$A$2:$C$31,2),\"\")","v":"Thermal Socks"},{"$f":"_xlfn.IFNA(VLOOKUP($C9,'Product Information'!$A$2:$C$31,3),\"\")","v":12.99}]
[{"$f":"IF('Input Calculation'!B4=4438641204,'Input Calculation'!A4,\"\")","v":""},null,{"$f":"IFERROR(VLOOKUP(VALUE($B$8),'Input Calculation'!$A$2:$AJ$29,13),\"\")","v":9242514},{"$f":"_xlfn.IFNA(VLOOKUP($C10,'Product Information'!$A$2:$C$31,2),\"\")","v":"Fashionista Sunglasses"},{"$f":"_xlfn.IFNA(VLOOKUP($C10,'Product Information'!$A$2:$C$31,3),\"\")","v":499.99}]
[{"$f":"IF('Input Calculation'!B5=4438641204,'Input Calculation'!A5,\"\")","v":""},null,{"$f":"IFERROR(VLOOKUP(VALUE($B$8),'Input Calculation'!$A$2:$AJ$29,15),\"\")","v":""},{"$f":"_xlfn.IFNA(VLOOKUP($C11,'Product Information'!$A$2:$C$31,2),\"\")","v":""},{"$f":"_xlfn.IFNA(VLOOKUP($C11,'Product Information'!$A$2:$C$31,3),\"\")","v":""}]
[{"$f":"IF('Input Calculation'!B6=4438641204,'Input Calculation'!A6,\"\")","v":""},null,{"$f":"IFERROR(VLOOKUP(VALUE($B$8),'Input Calculation'!$A$2:$AJ$29,17),\"\")","v":""},{"$f":"_xlfn.IFNA(VLOOKUP($C12,'Product Information'!$A$2:$C$31,2),\"\")","v":""},{"$f":"_xlfn.IFNA(VLOOKUP($C12,'Product Information'!$A$2:$C$31,3),\"\")","v":""}]
[{"$f":"IF('Input Calculation'!B7=4438641204,'Input Calculation'!A7,\"\")","v":""},null,{"$f":"IFERROR(VLOOKUP(VALUE($B$8),'Input Calculation'!$A$2:$AJ$29,19),\"\")","v":""},{"$f":"_xlfn.IFNA(VLOOKUP($C13,'Product Information'!$A$2:$C$31,2),\"\")","v":""},{"$f":"_xlfn.IFNA(VLOOKUP($C13,'Product Information'!$A$2:$C$31,3),\"\")","v":""}]
[{"$f":"IF('Input Calculation'!B8=4438641204,'Input Calculation'!A8,\"\")","v":""},null,{"$f":"IFERROR(VLOOKUP(VALUE($B$8),'Input Calculation'!$A$2:$AJ$29,21),\"\")","v":""},{"$f":"_xlfn.IFNA(VLOOKUP($C14,'Product Information'!$A$2:$C$31,2),\"\")","v":""},{"$f":"_xlfn.IFNA(VLOOKUP($C14,'Product Information'!$A$2:$C$31,3),\"\")","v":""}]
[{"$f":"IF('Input Calculation'!B9=4438641204,'Input Calculation'!A9,\"\")","v":""},null,{"$f":"IFERROR(VLOOKUP(VALUE($B$8),'Input Calculation'!$A$2:$AJ$29,23),\"\")","v":""},{"$f":"_xlfn.IFNA(VLOOKUP($C15,'Product Information'!$A$2:$C$31,2),\"\")","v":""},{"$f":"_xlfn.IFNA(VLOOKUP($C15,'Product Information'!$A$2:$C$31,3),\"\")","v":""}]
[{"$f":"IF('Input Calculation'!B10=4438641204,'Input Calculation'!A10,\"\")","v":""},null,{"$f":"IFERROR(VLOOKUP(VALUE($B$8),'Input Calculation'!$A$2:$AJ$29,25),\"\")","v":""},{"$f":"_xlfn.IFNA(VLOOKUP($C16,'Product Information'!$A$2:$C$31,2),\"\")","v":""},{"$f":"_xlfn.IFNA(VLOOKUP($C16,'Product Information'!$A$2:$C$31,3),\"\")","v":""}]
[{"$f":"IF('Input Calculation'!B11=4438641204,'Input Calculation'!A11,\"\")","v":""},null,{"$f":"IFERROR(VLOOKUP(VALUE($B$8),'Input Calculation'!$A$2:$AJ$29,27),\"\")","v":""},{"$f":"_xlfn.IFNA(VLOOKUP($C17,'Product Information'!$A$2:$C$31,2),\"\")","v":""},{"$f":"_xlfn.IFNA(VLOOKUP($C17,'Product Information'!$A$2:$C$31,3),\"\")","v":""}]
[{"$f":"IF('Input Calculation'!B12=4438641204,'Input Calculation'!A12,\"\")","v":1011},null,null,"Total:",{"$f":"VLOOKUP(VALUE($B$8),'Input Calculation'!$A$2:$AJ$29,36)","v":601.74},"Notes: "]
[{"$f":"IF('Input Calculation'!B13=4438641204,'Input Calculation'!A13,\"\")","v":""}]
[{"$f":"IF('Input Calculation'!B14=4438641204,'Input Calculation'!A14,\"\")","v":""},{"$f":"MID($A$7,LEN(B8)+1,4)","v":""},{"$f":"IFERROR(VLOOKUP(VALUE($B$20),'Input Calculation'!$A$2:$AJ$29,9),\"\")","v":""},{"$f":"_xlfn.IFNA(VLOOKUP($C20,'Product Information'!$A$2:$C$31,2),\"\")","v":""},{"$f":"_xlfn.IFNA(VLOOKUP($C20,'Product Information'!$A$2:$C$31,3),\"\")","v":""}]
[{"$f":"IF('Input Calculation'!B15=4438641204,'Input Calculation'!A15,\"\")","v":""},null,{"$f":"IFERROR(VLOOKUP(VALUE($B$20),'Input Calculation'!$A$2:$AJ$29,11),\"\")","v":""},{"$f":"_xlfn.IFNA(VLOOKUP($C21,'Product Information'!$A$2:$C$31,2),\"\")","v":""},{"$f":"_xlfn.IFNA(VLOOKUP($C21,'Product Information'!$A$2:$C$31,3),\"\")","v":""}]
[{"$f":"IF('Input Calculation'!B16=4438641204,'Input Calculation'!A16,\"\")","v":""},null,{"$f":"IFERROR(VLOOKUP(VALUE($B$20),'Input Calculation'!$A$2:$AJ$29,13),\"\")","v":""},{"$f":"_xlfn.IFNA(VLOOKUP($C22,'Product Information'!$A$2:$C$31,2),\"\")","v":""},{"$f":"_xlfn.IFNA(VLOOKUP($C22,'Product Information'!$A$2:$C$31,3),\"\")","v":""}]
[{"$f":"IF('Input Calculation'!B17=4438641204,'Input Calculation'!A17,\"\")","v":""},null,{"$f":"IFERROR(VLOOKUP(VALUE($B$20),'Input Calculation'!$A$2:$AJ$29,15),\"\")","v":""},{"$f":"_xlfn.IFNA(VLOOKUP($C23,'Product Information'!$A$2:$C$31,2),\"\")","v":""},{"$f":"_xlfn.IFNA(VLOOKUP($C23,'Product Information'!$A$2:$C$31,3),\"\")","v":""}]
[{"$f":"IF('Input Calculation'!B18=4438641204,'Input Calculation'!A18,\"\")","v":""},null,{"$f":"IFERROR(VLOOKUP(VALUE($B$20),'Input Calculation'!$A$2:$AJ$29,17),\"\")","v":""},{"$f":"_xlfn.IFNA(VLOOKUP($C24,'Product Information'!$A$2:$C$31,2),\"\")","v":""},{"$f":"_xlfn.IFNA(VLOOKUP($C24,'Product Information'!$A$2:$C$31,3),\"\")","v":""}]
[{"$f":"IF('Input Calculation'!B19=4438641204,'Input Calculation'!A19,\"\")","v":""},null,{"$f":"IFERROR(VLOOKUP(VALUE($B$20),'Input Calculation'!$A$2:$AJ$29,19),\"\")","v":""},{"$f":"_xlfn.IFNA(VLOOKUP($C25,'Product Information'!$A$2:$C$31,2),\"\")","v":""},{"$f":"_xlfn.IFNA(VLOOKUP($C25,'Product Information'!$A$2:$C$31,3),\"\")","v":""}]
[{"$f":"IF('Input Calculation'!B20=4438641204,'Input Calculation'!A20,\"\")","v":""},null,{"$f":"IFERROR(VLOOKUP(VALUE($B$20),'Input Calculation'!$A$2:$AJ$29,21),\"\")","v":""},{"$f":"_xlfn.IFNA(VLOOKUP($C26,'Product Information'!$A$2:$C$31,2),\"\")","v":""},{"$f":"_xlfn.IFNA(VLOOKUP($C26,'Product Information'!$A$2:$C$31,3),\"\")","v":""}]
[{"$f":"IF('Input Calculation'!B21=4438641204,'Input Calculation'!A21,\"\")","v":""},null,{"$f":"IFERROR(VLOOKUP(VALUE($B$20),'Input Calculation'!$A$2:$AJ$29,23),\"\")","v":""},{"$f":"_xlfn.IFNA(VLOOKUP($C27,'Product Information'!$A$2:$C$31,2),\"\")","v":""},{"$f":"_xlfn.IFNA(VLOOKUP($C27,'Product Information'!$A$2:$C$31,3),\"\")","v":""}]
[{"$f":"IF('Input Calculation'!B22=4438641204,'Input Calculation'!A22,\"\")","v":""},null,{"$f":"IFERROR(VLOOKUP(VALUE($B$20),'Input Calculation'!$A$2:$AJ$29,25),\"\")","v":""},{"$f":"_xlfn.IFNA(VLOOKUP($C28,'Product Information'!$A$2:$C$31,2),\"\")","v":""},{"$f":"_xlfn.IFNA(VLOOKUP($C28,'Product Information'!$A$2:$C$31,3),\"\")","v":""}]
[{"$f":"IF('Input Calculation'!B23=4438641204,'Input Calculation'!A23,\"\")","v":""},null,{"$f":"IFERROR(VLOOKUP(VALUE($B$20),'Input Calculation'!$A$2:$AJ$29,27),\"\")","v":""},{"$f":"_xlfn.IFNA(VLOOKUP($C29,'Product Information'!$A$2:$C$31,2),\"\")","v":""},{"$f":"_xlfn.IFNA(VLOOKUP($C29,'Product Information'!$A$2:$C$31,3),\"\")","v":""}]
[{"$f":"IF('Input Calculation'!B24=4438641204,'Input Calculation'!A24,\"\")","v":""},null,null,"Total:",{"$f":"IFERROR(VLOOKUP(VALUE($B$20),'Input Calculation'!$A$2:$AJ$29,36),\"\")","v":""},"Notes: "]
[{"$f":"IF('Input Calculation'!B25=4438641204,'Input Calculation'!A25,\"\")","v":""}]
[{"$f":"IF('Input Calculation'!B26=4438641204,'Input Calculation'!A26,\"\")","v":""},{"$f":"MID($A$7,LEN(B8)+LEN(B20)+1,4)","v":""},{"$f":"IFERROR(VLOOKUP(VALUE($B$32),'Input Calculation'!$A$2:$AJ$29,9),\"\")","v":""},{"$f":"_xlfn.IFNA(VLOOKUP($C32,'Product Information'!$A$2:$C$31,2),\"\")","v":""},{"$f":"_xlfn.IFNA(VLOOKUP($C32,'Product Information'!$A$2:$C$31,3),\"\")","v":""}]
[{"$f":"IF('Input Calculation'!B27=4438641204,'Input Calculation'!A27,\"\")","v":""},null,{"$f":"IFERROR(VLOOKUP(VALUE($B$32),'Input Calculation'!$A$2:$AJ$29,11),\"\")","v":""},{"$f":"_xlfn.IFNA(VLOOKUP($C33,'Product Information'!$A$2:$C$31,2),\"\")","v":""},{"$f":"_xlfn.IFNA(VLOOKUP($C33,'Product Information'!$A$2:$C$31,3),\"\")","v":""}]
[{"$f":"IF('Input Calculation'!B28=4438641204,'Input Calculation'!A28,\"\")","v":""},null,{"$f":"IFERROR(VLOOKUP(VALUE($B$32),'Input Calculation'!$A$2:$AJ$29,13),\"\")","v":""},{"$f":"_xlfn.IFNA(VLOOKUP($C34,'Product Information'!$A$2:$C$31,2),\"\")","v":""},{"$f":"_xlfn.IFNA(VLOOKUP($C34,'Product Information'!$A$2:$C$31,3),\"\")","v":""}]
[{"$f":"IF('Input Calculation'!B29=4438641204,'Input Calculation'!A29,\"\")","v":""},null,{"$f":"IFERROR(VLOOKUP(VALUE($B$32),'Input Calculation'!$A$2:$AJ$29,15),\"\")","v":""},{"$f":"_xlfn.IFNA(VLOOKUP($C35,'Product Information'!$A$2:$C$31,2),\"\")","v":""},{"$f":"_xlfn.IFNA(VLOOKUP($C35,'Product Information'!$A$2:$C$31,3),\"\")","v":""}]
[{"$f":"IF('Input Calculation'!B30=4438641204,'Input Calculation'!A30,\"\")","v":""},null,{"$f":"IFERROR(VLOOKUP(VALUE($B$32),'Input Calculation'!$A$2:$AJ$29,17),\"\")","v":""},{"$f":"_xlfn.IFNA(VLOOKUP($C36,'Product Information'!$A$2:$C$31,2),\"\")","v":""},{"$f":"_xlfn.IFNA(VLOOKUP($C36,'Product Information'!$A$2:$C$31,3),\"\")","v":""}]
[null,null,{"$f":"IFERROR(VLOOKUP(VALUE($B$32),'Input Calculation'!$A$2:$AJ$29,19),\"\")","v":""},{"$f":"_xlfn.IFNA(VLOOKUP($C37,'Product Information'!$A$2:$C$31,2),\"\")","v":""},{"$f":"_xlfn.IFNA(VLOOKUP($C37,'Product Information'!$A$2:$C$31,3),\"\")","v":""}]
[null,null,{"$f":"IFERROR(VLOOKUP(VALUE($B$32),'Input Calculation'!$A$2:$AJ$29,21),\"\")","v":""},{"$f":"_xlfn.IFNA(VLOOKUP($C38,'Product Information'!$A$2:$C$31,2),\"\")","v":""},{"$f":"_xlfn.IFNA(VLOOKUP($C38,'Product Information'!$A$2:$C$31,3),\"\")","v":""}]
[null,null,{"$f":"IFERROR(VLOOKUP(VALUE($B$32),'Input Calculation'!$A$2:$AJ$29,23),\"\")","v":""},{"$f":"_xlfn.IFNA(VLOOKUP($C39,'Product Information'!$A$2:$C$31,2),\"\")","v":""},{"$f":"_xlfn.IFNA(VLOOKUP($C39,'Product Information'!$A$2:$C$31,3),\"\")","v":""}]
[null,null,{"$f":"IFERROR(VLOOKUP(VALUE($B$32),'Input Calculation'!$A$2:$AJ$29,25),\"\")","v":""},{"$f":"_xlfn.IFNA(VLOOKUP($C40,'Product Information'!$A$2:$C$31,2),\"\")","v":""},{"$f":"_xlfn.IFNA(VLOOKUP($C40,'Product Information'!$A$2:$C$31,3),\"\")","v":""}]
[null,null,{"$f":"IFERROR(VLOOKUP(VALUE($B$32),'Input Calculation'!$A$2:$AJ$29,27),\"\")","v":""},{"$f":"_xlfn.IFNA(VLOOKUP($C41,'Product Information'!$A$2:$C$31,2),\"\")","v":""},{"$f":"_xlfn.IFNA(VLOOKUP($C41,'Product Information'!$A$2:$C$31,3),\"\")","v":""}]
[null,null,null,"Total:",{"$f":"IFERROR(VLOOKUP(VALUE($B$32),'Input Calculation'!$A$2:$AJ$29,36),\"\")","v":""},"Notes: "]
[]
[null,{"$f":"MID($A$7,LEN(B8)+LEN(B20)+LEN(B32)+1,4)","v":""},{"$f":"IFERROR(VLOOKUP(VALUE($B$44),'Input Calculation'!$A$2:$AJ$29,9),\"\")","v":""},{"$f":"_xlfn.IFNA(VLOOKUP($C44,'Product Information'!$A$2:$C$31,2),\"\")","v":""},{"$f":"_xlfn.IFNA(VLOOKUP($C44,'Product Information'!$A$2:$C$31,3),\"\")","v":""}]
[null,null,{"$f":"IFERROR(VLOOKUP(VALUE($B$45),'Input Calculation'!$A$2:$AJ$29,11),\"\")","v":""},{"$f":"_xlfn.IFNA(VLOOKUP($C45,'Product Information'!$A$2:$C$31,2),\"\")","v":""},{"$f":"_xlfn.IFNA(VLOOKUP($C45,'Product Information'!$A$2:$C$31,3),\"\")","v":""}]
[null,null,{"$f":"IFERROR(VLOOKUP(VALUE($B$46),'Input Calculation'!$A$2:$AJ$29,13),\"\")","v":""},{"$f":"_xlfn.IFNA(VLOOKUP($C46,'Product Information'!$A$2:$C$31,2),\"\")","v":""},{"$f":"_xlfn.IFNA(VLOOKUP($C46,'Product Information'!$A$2:$C$31,3),\"\")","v":""}]
[null,null,{"$f":"IFERROR(VLOOKUP(VALUE($B$46),'Input Calculation'!$A$2:$AJ$29,15),\"\")","v":""},{"$f":"_xlfn.IFNA(VLOOKUP($C47,'Product Information'!$A$2:$C$31,2),\"\")","v":""},{"$f":"_xlfn.IFNA(VLOOKUP($C47,'Product Information'!$A$2:$C$31,3),\"\")","v":""}]
[null,null,{"$f":"IFERROR(VLOOKUP(VALUE($B$46),'Input Calculation'!$A$2:$AJ$29,17),\"\")","v":""},{"$f":"_xlfn.IFNA(VLOOKUP($C48,'Product Information'!$A$2:$C$31,2),\"\")","v":""},{"$f":"_xlfn.IFNA(VLOOKUP($C48,'Product Information'!$A$2:$C$31,3),\"\")","v":""}]
[null,null,{"$f":"IFERROR(VLOOKUP(VALUE($B$46),'Input Calculation'!$A$2:$AJ$29,19),\"\")","v":""},{"$f":"_xlfn.IFNA(VLOOKUP($C49,'Product Information'!$A$2:$C$31,2),\"\")","v":""},{"$f":"_xlfn.IFNA(VLOOKUP($C49,'Product Information'!$A$2:$C$31,3),\"\")","v":""}]
[null,null,{"$f":"IFERROR(VLOOKUP(VALUE($B$46),'Input Calculation'!$A$2:$AJ$29,21),\"\")","v":""},{"$f":"_xlfn.IFNA(VLOOKUP($C50,'Product Information'!$A$2:$C$31,2),\"\")","v":""},{"$f":"_xlfn.IFNA(VLOOKUP($C50,'Product Information'!$A$2:$C$31,3),\"\")","v":""}]
[null,null,{"$f":"IFERROR(VLOOKUP(VALUE($B$46),'Input Calculation'!$A$2:$AJ$29,23),\"\")","v":""},{"$f":"_xlfn.IFNA(VLOOKUP($C51,'Product Information'!$A$2:$C$31,2),\"\")","v":""},{"$f":"_xlfn.IFNA(VLOOKUP($C51,'Product Information'!$A$2:$C$31,3),\"\")","v":""}]
[null,null,{"$f":"IFERROR(VLOOKUP(VALUE($B$46),'Input Calculation'!$A$2:$AJ$29,25),\"\")","v":""},{"$f":"_xlfn.IFNA(VLOOKUP($C52,'Product Information'!$A$2:$C$31,2),\"\")","v":""},{"$f":"_xlfn.IFNA(VLOOKUP($C52,'Product Information'!$A$2:$C$31,3),\"\")","v":""}]
[null,null,{"$f":"IFERROR(VLOOKUP(VALUE($B$46),'Input Calculation'!$A$2:$AJ$29,27),\"\")","v":""},{"$f":"_xlfn.IFNA(VLOOKUP($C53,'Product Information'!$A$2:$C$31,2),\"\")","v":""},{"$f":"_xlfn.IFNA(VLOOKUP($C53,'Product Information'!$A$2:$C$31,3),\"\")","v":""}]
[null,null,null,"Total:",{"$f":"IFERROR(VLOOKUP(VALUE($B$46),'Input Calculation'!$A$2:$AJ$29,36),\"\")","v":""},"Notes: "]
[]
[null,{"$f":"MID($A$7,LEN(B8)+LEN(B20)+LEN(B32)+LEN(B46)+1,4)","v":""},{"$f":"IFERROR(VLOOKUP(VALUE($B$56),'Input Calculation'!$A$2:$AJ$29,9),\"\")","v":""},{"$f":"_xlfn.IFNA(VLOOKUP($C56,'Product Information'!$A$2:$C$31,2),\"\")","v":""},{"$f":"_xlfn.IFNA(VLOOKUP($C56,'Product Information'!$A$2:$C$31,3),\"\")","v":""}]
[null,null,{"$f":"IFERROR(VLOOKUP(VALUE($B$56),'Input Calculation'!$A$2:$AJ$29,11),\"\")","v":""},{"$f":"_xlfn.IFNA(VLOOKUP($C57,'Product Information'!$A$2:$C$31,2),\"\")","v":""},{"$f":"_xlfn.IFNA(VLOOKUP($C57,'Product Information'!$A$2:$C$31,3),\"\")","v":""}]
[null,null,{"$f":"IFERROR(VLOOKUP(VALUE($B$56),'Input Calculation'!$A$2:$AJ$29,13),\"\")","v":""},{"$f":"_xlfn.IFNA(VLOOKUP($C58,'Product Information'!$A$2:$C$31,2),\"\")","v":""},{"$f":"_xlfn.IFNA(VLOOKUP($C58,'Product Information'!$A$2:$C$31,3),\"\")","v":""}]
[null,null,{"$f":"IFERROR(VLOOKUP(VALUE($B$56),'Input Calculation'!$A$2:$AJ$29,15),\"\")","v":""},{"$f":"_xlfn.IFNA(VLOOKUP($C59,'Product Information'!$A$2:$C$31,2),\"\")","v":""},{"$f":"_xlfn.IFNA(VLOOKUP($C59,'Product Information'!$A$2:$C$31,3),\"\")","v":""}]
[null,null,{"$f":"IFERROR(VLOOKUP(VALUE($B$56),'Input Calculation'!$A$2:$AJ$29,17),\"\")","v":""},{"$f":"_xlfn.IFNA(VLOOKUP($C60,'Product Information'!$A$2:$C$31,2),\"\")","v":""},{"$f":"_xlfn.IFNA(VLOOKUP($C60,'Product Information'!$A$2:$C$31,3),\"\")","v":""}]
[null,null,{"$f":"IFERROR(VLOOKUP(VALUE($B$56),'Input Calculation'!$A$2:$AJ$29,19),\"\")","v":""},{"$f":"_xlfn.IFNA(VLOOKUP($C61,'Product Information'!$A$2:$C$31,2),\"\")","v":""},{"$f":"_xlfn.IFNA(VLOOKUP($C61,'Product Information'!$A$2:$C$31,3),\"\")","v":""}]
[null,null,{"$f":"IFERROR(VLOOKUP(VALUE($B$56),'Input Calculation'!$A$2:$AJ$29,21),\"\")","v":""},{"$f":"_xlfn.IFNA(VLOOKUP($C62,'Product Information'!$A$2:$C$31,2),\"\")","v":""},{"$f":"_xlfn.IFNA(VLOOKUP($C62,'Product Information'!$A$2:$C$31,3),\"\")","v":""}]
[null,null,{"$f":"IFERROR(VLOOKUP(VALUE($B$56),'Input Calculation'!$A$2:$AJ$29,23),\"\")","v":""},{"$f":"_xlfn.IFNA(VLOOKUP($C63,'Product Information'!$A$2:$C$31,2),\"\")","v":""},{"$f":"_xlfn.IFNA(VLOOKUP($C63,'Product Information'!$A$2:$C$31,3),\"\")","v":""}]
[null,null,{"$f":"IFERROR(VLOOKUP(VALUE($B$56),'Input Calculation'!$A$2:$AJ$29,25),\"\")","v":""},{"$f":"_xlfn.IFNA(VLOOKUP($C64,'Product Information'!$A$2:$C$31,2),\"\")","v":""},{"$f":"_xlfn.IFNA(VLOOKUP($C64,'Product Information'!$A$2:$C$31,3),\"\")","v":""}]
[null,null,{"$f":"IFERROR(VLOOKUP(VALUE($B$56),'Input Calculation'!$A$2:$AJ$29,27),\"\")","v":""},{"$f":"_xlfn.IFNA(VLOOKUP($C65,'Product Information'!$A$2:$C$31,2),\"\")","v":""},{"$f":"_xlfn.IFNA(VLOOKUP($C65,'Product Information'!$A$2:$C$31,3),\"\")","v":""}]
[null,null,null,"Total:",{"$f":"IFERROR(VLOOKUP(VALUE($B$56),'Input Calculation'!$A$2:$AJ$29,36),\"\")","v":""},"Notes: "]
[null,{"$f":"MID($A$7,4*(ROW()-7),4)","v":""}]
[null,{"$f":"MID($A$7,LEN(B8)+LEN(B20)+LEN(B32)+LEN(B46)+LEN(B56)+1,4)","v":""},{"$f":"IFERROR(VLOOKUP(VALUE($B$68),'Input Calculation'!$A$2:$AJ$29,9),\"\")","v":""},{"$f":"_xlfn.IFNA(VLOOKUP($C68,'Product Information'!$A$2:$C$31,2),\"\")","v":""},{"$f":"_xlfn.IFNA(VLOOKUP($C68,'Product Information'!$A$2:$C$31,3),\"\")","v":""}]
[null,null,{"$f":"IFERROR(VLOOKUP(VALUE($B$68),'Input Calculation'!$A$2:$AJ$29,11),\"\")","v":""},{"$f":"_xlfn.IFNA(VLOOKUP($C69,'Product Information'!$A$2:$C$31,2),\"\")","v":""},{"$f":"_xlfn.IFNA(VLOOKUP($C69,'Product Information'!$A$2:$C$31,3),\"\")","v":""}]
[null,null,{"$f":"IFERROR(VLOOKUP(VALUE($B$68),'Input Calculation'!$A$2:$AJ$29,13),\"\")","v":""},{"$f":"_xlfn.IFNA(VLOOKUP($C70,'Product Information'!$A$2:$C$31,2),\"\")","v":""},{"$f":"_xlfn.IFNA(VLOOKUP($C70,'Product Information'!$A$2:$C$31,3),\"\")","v":""}]
[null,null,{"$f":"IFERROR(VLOOKUP(VALUE($B$68),'Input Calculation'!$A$2:$AJ$29,15),\"\")","v":""},{"$f":"_xlfn.IFNA(VLOOKUP($C71,'Product Information'!$A$2:$C$31,2),\"\")","v":""},{"$f":"_xlfn.IFNA(VLOOKUP($C71,'Product Information'!$A$2:$C$31,3),\"\")","v":""}]
[null,null,{"$f":"IFERROR(VLOOKUP(VALUE($B$68),'Input Calculation'!$A$2:$AJ$29,17),\"\")","v":""},{"$f":"_xlfn.IFNA(VLOOKUP($C72,'Product Information'!$A$2:$C$31,2),\"\")","v":""},{"$f":"_xlfn.IFNA(VLOOKUP($C72,'Product Information'!$A$2:$C$31,3),\"\")","v":""}]
[null,null,{"$f":"IFERROR(VLOOKUP(VALUE($B$68),'Input Calculation'!$A$2:$AJ$29,19),\"\")","v":""},{"$f":"_xlfn.IFNA(VLOOKUP($C73,'Product Information'!$A$2:$C$31,2),\"\")","v":""},{"$f":"_xlfn.IFNA(VLOOKUP($C73,'Product Information'!$A$2:$C$31,3),\"\")","v":""}]
[null,null,{"$f":"IFERROR(VLOOKUP(VALUE($B$68),'Input Calculation'!$A$2:$AJ$29,21),\"\")","v":""},{"$f":"_xlfn.IFNA(VLOOKUP($C74,'Product Information'!$A$2:$C$31,2),\"\")","v":""},{"$f":"_xlfn.IFNA(VLOOKUP($C74,'Product Information'!$A$2:$C$31,3),\"\")","v":""}]
[null,null,{"$f":"IFERROR(VLOOKUP(VALUE($B$68),'Input Calculation'!$A$2:$AJ$29,23),\"\")","v":""},{"$f":"_xlfn.IFNA(VLOOKUP($C75,'Product Information'!$A$2:$C$31,2),\"\")","v":""},{"$f":"_xlfn.IFNA(VLOOKUP($C75,'Product Information'!$A$2:$C$31,3),\"\")","v":""}]
[null,null,{"$f":"IFERROR(VLOOKUP(VALUE($B$68),'Input Calculation'!$A$2:$AJ$29,25),\"\")","v":""},{"$f":"_xlfn.IFNA(VLOOKUP($C76,'Product Information'!$A$2:$C$31,2),\"\")","v":""},{"$f":"_xlfn.IFNA(VLOOKUP($C76,'Product Information'!$A$2:$C$31,3),\"\")","v":""}]
[null,null,{"$f":"IFERROR(VLOOKUP(VALUE($B$68),'Input Calculation'!$A$2:$AJ$29,27),\"\")","v":""},{"$f":"_xlfn.IFNA(VLOOKUP($C77,'Product Information'!$A$2:$C$31,2),\"\")","v":""},{"$f":"_xlfn.IFNA(VLOOKUP($C77,'Product Information'!$A$2:$C$31,3),\"\")","v":""}]
[null,null,null,"Total:",{"$f":"IFERROR(VLOOKUP(VALUE($B$68),'Input Calculation'!$A$2:$AJ$29,36),\"\")","v":""},"Notes: "]
[null,{"$f":"MID($A$7,4*(ROW()-7),4)","v":""}]
[null,{"$f":"MID($A$7,4*(ROW()-7),4)","v":""}]

{"sheet":"5168832323","index":10,"n_rows":80,"n_cols":6,"rows_kept":80,"cut":false,"hidden":true,"merged":[]}
["Name:",{"$f":"VLOOKUP(5168832323,'Customer Information'!$A$2:$I$12,2)","v":"Wont William"}]
["Phone:",{"$f":"TEXT(5168832323,\"###-###-####\")","v":"516-883-2323"}]
["Email:",{"$f":"VLOOKUP(5168832323,'Customer Information'!$A$2:$I$12,3)","v":"NotHere@yahoo.com"}]
["Address:",{"$f":"CONCATENATE(VLOOKUP(5168832323,'Customer Information'!$A$2:$I$12,4),\", \",VLOOKUP(5168832323,'Customer Information'!$A$2:$I$12,5),\", \",VLOOKUP(5168832323,'Customer Information'!$A$2:$I$12,6),\" \",VLOOKUP(5168832323,'Customer Information'!$A$2:$I$12,7))","v":"823 1st St, Kansas City, MO 65923"}]
["Customer Since:",{"$f":"VLOOKUP(5168832323,'Customer Information'!$A$2:$I$12,8)","v":2020}]
["Good Standing:",{"$f":"VLOOKUP(5168832323,'Customer Information'!$A$2:$I$12,9)","v":"Yes"}]
[{"$f":"CONCATENATE(A8,A9,A10,A11,A12,A13,A14,A15,A16,A17,A18,A19,A20,A21,A22,A23,A24,A25,A26,A27,A28,A29,A30,A31,A32,A33,A34,A35,A36)","v":"100510131027"},"Order Number"]
[{"$f":"IF('Input Calculation'!B2=5168832323,'Input Calculation'!A2,\"\")","v":""},{"$f":"MID($A$7,ROW()-7,4)","v":"1005"},{"$f":"IFERROR(VLOOKUP(VALUE($B$8),'Input Calculation'!$A$2:$AJ$29,9),\"\")","v":9242514},{"$f":"_xlfn.IFNA(VLOOKUP($C8,'Product Information'!$A$2:$C$31,2),\"\")","v":"Fashionista Sunglasses"},{"$f":"_xlfn.IFNA(VLOOKUP($C8,'Product Information'!$A$2:$C$31,3),\"\")","v":499.99}]
[{"$f":"IF('Input Calculation'!B3=5168832323,'Input Calculation'!A3,\"\")","v":""},null,{"$f":"IFERROR(VLOOKUP(VALUE($B$8),'Input Calculation'!$A$2:$AJ$29,11),\"\")","v":3055845},{"$f":"_xlfn.IFNA(VLOOKUP($C9,'Product Information'!$A$2:$C$31,2),\"\")","v":"Winter Jacket"},{"$f":"_xlfn.IFNA(VLOOKUP($C9,'Product Information'!$A$2:$C$31,3),\"\")","v":199.99}]
[{"$f":"IF('Input Calculation'!B4=5168832323,'Input Calculation'!A4,\"\")","v":""},null,{"$f":"IFERROR(VLOOKUP(VALUE($B$8),'Input Calculation'!$A$2:$AJ$29,13),\"\")","v":7250412},{"$f":"_xlfn.IFNA(VLOOKUP($C10,'Product Information'!$A$2:$C$31,2),\"\")","v":"Thermal Socks"},{"$f":"_xlfn.IFNA(VLOOKUP($C10,'Product Information'!$A$2:$C$31,3),\"\")","v":12.99}]
[{"$f":"IF('Input Calculation'!B5=5168832323,'Input Calculation'!A5,\"\")","v":""},null,{"$f":"IFERROR(VLOOKUP(VALUE($B$8),'Input Calculation'!$A$2:$AJ$29,15),\"\")","v":""},{"$f":"_xlfn.IFNA(VLOOKUP($C11,'Product Information'!$A$2:$C$31,2),\"\")","v":""},{"$f":"_xlfn.IFNA(VLOOKUP($C11,'Product Information'!$A$2:$C$31,3),\"\")","v":""}]
[{"$f":"IF('Input Calculation'!B6=5168832323,'Input Calculation'!A6,\"\")","v":1005},null,{"$f":"IFERROR(VLOOKUP(VALUE($B$8),'Input Calculation'!$A$2:$AJ$29,17),\"\")","v":""},{"$f":"_xlfn.IFNA(VLOOKUP($C12,'Product Information'!$A$2:$C$31,2),\"\")","v":""},{"$f":"_xlfn.IFNA(VLOOKUP($C12,'Product Information'!$A$2:$C$31,3),\"\")","v":""}]
[{"$f":"IF('Input Calculation'!B7=5168832323,'Input Calculation'!A7,\"\")","v":""},null,{"$f":"IFERROR(VLOOKUP(VALUE($B$8),'Input Calculation'!$A$2:$AJ$29,19),\"\")","v":""},{"$f":"_xlfn.IFNA(VLOOKUP($C13,'Product Information'!$A$2:$C$31,2),\"\")","v":""},{"$f":"_xlfn.IFNA(VLOOKUP($C13,'Product Information'!$A$2:$C$31,3),\"\")","v":""}]
[{"$f":"IF('Input Calculation'!B8=5168832323,'Input Calculation'!A8,\"\")","v":""},null,{"$f":"IFERROR(VLOOKUP(VALUE($B$8),'Input Calculation'!$A$2:$AJ$29,21),\"\")","v":""},{"$f":"_xlfn.IFNA(VLOOKUP($C14,'Product Information'!$A$2:$C$31,2),\"\")","v":""},{"$f":"_xlfn.IFNA(VLOOKUP($C14,'Product Information'!$A$2:$C$31,3),\"\")","v":""}]
[{"$f":"IF('Input Calculation'!B9=5168832323,'Input Calculation'!A9,\"\")","v":""},null,{"$f":"IFERROR(VLOOKUP(VALUE($B$8),'Input Calculation'!$A$2:$AJ$29,23),\"\")","v":""},{"$f":"_xlfn.IFNA(VLOOKUP($C15,'Product Information'!$A$2:$C$31,2),\"\")","v":""},{"$f":"_xlfn.IFNA(VLOOKUP($C15,'Product Information'!$A$2:$C$31,3),\"\")","v":""}]
[{"$f":"IF('Input Calculation'!B10=5168832323,'Input Calculation'!A10,\"\")","v":""},null,{"$f":"IFERROR(VLOOKUP(VALUE($B$8),'Input Calculation'!$A$2:$AJ$29,25),\"\")","v":""},{"$f":"_xlfn.IFNA(VLOOKUP($C16,'Product Information'!$A$2:$C$31,2),\"\")","v":""},{"$f":"_xlfn.IFNA(VLOOKUP($C16,'Product Information'!$A$2:$C$31,3),\"\")","v":""}]
[{"$f":"IF('Input Calculation'!B11=5168832323,'Input Calculation'!A11,\"\")","v":""},null,{"$f":"IFERROR(VLOOKUP(VALUE($B$8),'Input Calculation'!$A$2:$AJ$29,27),\"\")","v":""},{"$f":"_xlfn.IFNA(VLOOKUP($C17,'Product Information'!$A$2:$C$31,2),\"\")","v":""},{"$f":"_xlfn.IFNA(VLOOKUP($C17,'Product Information'!$A$2:$C$31,3),\"\")","v":""}]
[{"$f":"IF('Input Calculation'!B12=5168832323,'Input Calculation'!A12,\"\")","v":""},null,null,"Total:",{"$f":"VLOOKUP(VALUE($B$8),'Input Calculation'!$A$2:$AJ$29,36)","v":694.16000000000008},"Notes: "]
[{"$f":"IF('Input Calculation'!B13=5168832323,'Input Calculation'!A13,\"\")","v":""}]
[{"$f":"IF('Input Calculation'!B14=5168832323,'Input Calculation'!A14,\"\")","v":1013},{"$f":"MID($A$7,LEN(B8)+1,4)","v":"1013"},{"$f":"IFERROR(VLOOKUP(VALUE($B$20),'Input Calculation'!$A$2:$AJ$29,9),\"\")","v":8924251},{"$f":"_xlfn.IFNA(VLOOKUP($C20,'Product Information'!$A$2:$C$31,2),\"\")","v":"Super Sunglasses"},{"$f":"_xlfn.IFNA(VLOOKUP($C20,'Product Information'!$A$2:$C$31,3),\"\")","v":99.99}]
[{"$f":"IF('Input Calculation'!B15=5168832323,'Input Calculation'!A15,\"\")","v":""},null,{"$f":"IFERROR(VLOOKUP(VALUE($B$20),'Input Calculation'!$A$2:$AJ$29,11),\"\")","v":4989600},{"$f":"_xlfn.IFNA(VLOOKUP($C21,'Product Information'!$A$2:$C$31,2),\"\")","v":"Hard Hat"},{"$f":"_xlfn.IFNA(VLOOKUP($C21,'Product Information'!$A$2:$C$31,3),\"\")","v":29.99}]
[{"$f":"IF('Input Calculation'!B16=5168832323,'Input Calculation'!A16,\"\")","v":""},null,{"$f":"IFERROR(VLOOKUP(VALUE($B$20),'Input Calculation'!$A$2:$AJ$29,13),\"\")","v":5086187},{"$f":"_xlfn.IFNA(VLOOKUP($C22,'Product Information'!$A$2:$C$31,2),\"\")","v":"Top Hat"},{"$f":"_xlfn.IFNA(VLOOKUP($C22,'Product Information'!$A$2:$C$31,3),\"\")","v":39.99}]
[{"$f":"IF('Input Calculation'!B17=5168832323,'Input Calculation'!A17,\"\")","v":""},null,{"$f":"IFERROR(VLOOKUP(VALUE($B$20),'Input Calculation'!$A$2:$AJ$29,15),\"\")","v":5216388},{"$f":"_xlfn.IFNA(VLOOKUP($C23,'Product Information'!$A$2:$C$31,2),\"\")","v":"Logo Hat"},{"$f":"_xlfn.IFNA(VLOOKUP($C23,'Product Information'!$A$2:$C$31,3),\"\")","v":49.99}]
[{"$f":"IF('Input Calculation'!B18=5168832323,'Input Calculation'!A18,\"\")","v":""},null,{"$f":"IFERROR(VLOOKUP(VALUE($B$20),'Input Calculation'!$A$2:$AJ$29,17),\"\")","v":6671819},{"$f":"_xlfn.IFNA(VLOOKUP($C24,'Product Information'!$A$2:$C$31,2),\"\")","v":"Socks"},{"$f":"_xlfn.IFNA(VLOOKUP($C24,'Product Information'!$A$2:$C$31,3),\"\")","v":4.99}]
[{"$f":"IF('Input Calculation'!B19=5168832323,'Input Calculation'!A19,\"\")","v":""},null,{"$f":"IFERROR(VLOOKUP(VALUE($B$20),'Input Calculation'!$A$2:$AJ$29,19),\"\")","v":6738313},{"$f":"_xlfn.IFNA(VLOOKUP($C25,'Product Information'!$A$2:$C$31,2),\"\")","v":"Better Socks"},{"$f":"_xlfn.IFNA(VLOOKUP($C25,'Product Information'!$A$2:$C$31,3),\"\")","v":6.99}]
[{"$f":"IF('Input Calculation'!B20=5168832323,'Input Calculation'!A20,\"\")","v":""},null,{"$f":"IFERROR(VLOOKUP(VALUE($B$20),'Input Calculation'!$A$2:$AJ$29,21),\"\")","v":6808398},{"$f":"_xlfn.IFNA(VLOOKUP($C26,'Product Information'!$A$2:$C$31,2),\"\")","v":"Fuzzy Socks"},{"$f":"_xlfn.IFNA(VLOOKUP($C26,'Product Information'!$A$2:$C$31,3),\"\")","v":8.99}]
[{"$f":"IF('Input Calculation'!B21=5168832323,'Input Calculation'!A21,\"\")","v":""},null,{"$f":"IFERROR(VLOOKUP(VALUE($B$20),'Input Calculation'!$A$2:$AJ$29,23),\"\")","v":6832283},{"$f":"_xlfn.IFNA(VLOOKUP($C27,'Product Information'!$A$2:$C$31,2),\"\")","v":"Toe Socks"},{"$f":"_xlfn.IFNA(VLOOKUP($C27,'Product Information'!$A$2:$C$31,3),\"\")","v":9.99}]
[{"$f":"IF('Input Calculation'!B22=5168832323,'Input Calculation'!A22,\"\")","v":""},null,{"$f":"IFERROR(VLOOKUP(VALUE($B$20),'Input Calculation'!$A$2:$AJ$29,25),\"\")","v":7250412},{"$f":"_xlfn.IFNA(VLOOKUP($C28,'Product Information'!$A$2:$C$31,2),\"\")","v":"Thermal Socks"},{"$f":"_xlfn.IFNA(VLOOKUP($C28,'Product Information'!$A$2:$C$31,3),\"\")","v":12.99}]
[{"$f":"IF('Input Calculation'!B23=5168832323,'Input Calculation'!A23,\"\")","v":""},null,{"$f":"IFERROR(VLOOKUP(VALUE($B$20),'Input Calculation'!$A$2:$AJ$29,27),\"\")","v":""},{"$f":"_xlfn.IFNA(VLOOKUP($C29,'Product Information'!$A$2:$C$31,2),\"\")","v":""},{"$f":"_xlfn.IFNA(VLOOKUP($C29,'Product Information'!$A$2:$C$31,3),\"\")","v":""}]
[{"$f":"IF('Input Calculation'!B24=5168832323,'Input Calculation'!A24,\"\")","v":""},null,null,"Total:",{"$f":"IFERROR(VLOOKUP(VALUE($B$20),'Input Calculation'!$A$2:$AJ$29,36),\"\")","v":256.94000000000005},"Notes: "]
[{"$f":"IF('Input Calculation'!B25=5168832323,'Input Calculation'!A25,\"\")","v":""}]
[{"$f":"IF('Input Calculation'!B26=5168832323,'Input Calculation'!A26,\"\")","v":""},{"$f":"MID($A$7,LEN(B8)+LEN(B20)+1,4)","v":"1027"},{"$f":"IFERROR(VLOOKUP(VALUE($B$32),'Input Calculation'!$A$2:$AJ$29,9),\"\")","v":2056772},{"$f":"_xlfn.IFNA(VLOOKUP($C32,'Product Information'!$A$2:$C$31,2),\"\")","v":"Great Pants"},{"$f":"_xlfn.IFNA(VLOOKUP($C32,'Product Information'!$A$2:$C$31,3),\"\")","v":74.989999999999995}]
[{"$f":"IF('Input Calculation'!B27=5168832323,'Input Calculation'!A27,\"\")","v":""},null,{"$f":"IFERROR(VLOOKUP(VALUE($B$32),'Input Calculation'!$A$2:$AJ$29,11),\"\")","v":3055845},{"$f":"_xlfn.IFNA(VLOOKUP($C33,'Product Information'!$A$2:$C$31,2),\"\")","v":"Winter Jacket"},{"$f":"_xlfn.IFNA(VLOOKUP($C33,'Product Information'!$A$2:$C$31,3),\"\")","v":199.99}]
[{"$f":"IF('Input Calculation'!B28=5168832323,'Input Calculation'!A28,\"\")","v":1027},null,{"$f":"IFERROR(VLOOKUP(VALUE($B$32),'Input Calculation'!$A$2:$AJ$29,13),\"\")","v":""},{"$f":"_xlfn.IFNA(VLOOKUP($C34,'Product Information'!$A$2:$C$31,2),\"\")","v":""},{"$f":"_xlfn.IFNA(VLOOKUP($C34,'Product Information'!$A$2:$C$31,3),\"\")","v":""}]
[{"$f":"IF('Input Calculation'!B29=5168832323,'Input Calculation'!A29,\"\")","v":""},null,{"$f":"IFERROR(VLOOKUP(VALUE($B$32),'Input Calculation'!$A$2:$AJ$29,15),\"\")","v":""},{"$f":"_xlfn.IFNA(VLOOKUP($C35,'Product Information'!$A$2:$C$31,2),\"\")","v":""},{"$f":"_xlfn.IFNA(VLOOKUP($C35,'Product Information'!$A$2:$C$31,3),\"\")","v":""}]
[{"$f":"IF('Input Calculation'!B30=5168832323,'Input Calculation'!A30,\"\")","v":""},null,{"$f":"IFERROR(VLOOKUP(VALUE($B$32),'Input Calculation'!$A$2:$AJ$29,17),\"\")","v":""},{"$f":"_xlfn.IFNA(VLOOKUP($C36,'Product Information'!$A$2:$C$31,2),\"\")","v":""},{"$f":"_xlfn.IFNA(VLOOKUP($C36,'Product Information'!$A$2:$C$31,3),\"\")","v":""}]
[null,null,{"$f":"IFERROR(VLOOKUP(VALUE($B$32),'Input Calculation'!$A$2:$AJ$29,19),\"\")","v":""},{"$f":"_xlfn.IFNA(VLOOKUP($C37,'Product Information'!$A$2:$C$31,2),\"\")","v":""},{"$f":"_xlfn.IFNA(VLOOKUP($C37,'Product Information'!$A$2:$C$31,3),\"\")","v":""}]
[null,null,{"$f":"IFERROR(VLOOKUP(VALUE($B$32),'Input Calculation'!$A$2:$AJ$29,21),\"\")","v":""},{"$f":"_xlfn.IFNA(VLOOKUP($C38,'Product Information'!$A$2:$C$31,2),\"\")","v":""},{"$f":"_xlfn.IFNA(VLOOKUP($C38,'Product Information'!$A$2:$C$31,3),\"\")","v":""}]
[null,null,{"$f":"IFERROR(VLOOKUP(VALUE($B$32),'Input Calculation'!$A$2:$AJ$29,23),\"\")","v":""},{"$f":"_xlfn.IFNA(VLOOKUP($C39,'Product Information'!$A$2:$C$31,2),\"\")","v":""},{"$f":"_xlfn.IFNA(VLOOKUP($C39,'Product Information'!$A$2:$C$31,3),\"\")","v":""}]
[null,null,{"$f":"IFERROR(VLOOKUP(VALUE($B$32),'Input Calculation'!$A$2:$AJ$29,25),\"\")","v":""},{"$f":"_xlfn.IFNA(VLOOKUP($C40,'Product Information'!$A$2:$C$31,2),\"\")","v":""},{"$f":"_xlfn.IFNA(VLOOKUP($C40,'Product Information'!$A$2:$C$31,3),\"\")","v":""}]
[null,null,{"$f":"IFERROR(VLOOKUP(VALUE($B$32),'Input Calculation'!$A$2:$AJ$29,27),\"\")","v":""},{"$f":"_xlfn.IFNA(VLOOKUP($C41,'Product Information'!$A$2:$C$31,2),\"\")","v":""},{"$f":"_xlfn.IFNA(VLOOKUP($C41,'Product Information'!$A$2:$C$31,3),\"\")","v":""}]
[null,null,null,"Total:",{"$f":"IFERROR(VLOOKUP(VALUE($B$32),'Input Calculation'!$A$2:$AJ$29,36),\"\")","v":302.47000000000003},"Notes: "]
[]
[null,{"$f":"MID($A$7,LEN(B8)+LEN(B20)+LEN(B32)+1,4)","v":""},{"$f":"IFERROR(VLOOKUP(VALUE($B$44),'Input Calculation'!$A$2:$AJ$29,9),\"\")","v":""},{"$f":"_xlfn.IFNA(VLOOKUP($C44,'Product Information'!$A$2:$C$31,2),\"\")","v":""},{"$f":"_xlfn.IFNA(VLOOKUP($C44,'Product Information'!$A$2:$C$31,3),\"\")","v":""}]
[null,null,{"$f":"IFERROR(VLOOKUP(VALUE($B$44),'Input Calculation'!$A$2:$AJ$29,11),\"\")","v":""},{"$f":"_xlfn.IFNA(VLOOKUP($C45,'Product Information'!$A$2:$C$31,2),\"\")","v":""},{"$f":"_xlfn.IFNA(VLOOKUP($C45,'Product Information'!$A$2:$C$31,3),\"\")","v":""}]
[null,null,{"$f":"IFERROR(VLOOKUP(VALUE($B$44),'Input Calculation'!$A$2:$AJ$29,13),\"\")","v":""},{"$f":"_xlfn.IFNA(VLOOKUP($C46,'Product Information'!$A$2:$C$31,2),\"\")","v":""},{"$f":"_xlfn.IFNA(VLOOKUP($C46,'Product Information'!$A$2:$C$31,3),\"\")","v":""}]
[null,null,{"$f":"IFERROR(VLOOKUP(VALUE($B$44),'Input Calculation'!$A$2:$AJ$29,15),\"\")","v":""},{"$f":"_xlfn.IFNA(VLOOKUP($C47,'Product Information'!$A$2:$C$31,2),\"\")","v":""},{"$f":"_xlfn.IFNA(VLOOKUP($C47,'Product Information'!$A$2:$C$31,3),\"\")","v":""}]
[null,null,{"$f":"IFERROR(VLOOKUP(VALUE($B$44),'Input Calculation'!$A$2:$AJ$29,17),\"\")","v":""},{"$f":"_xlfn.IFNA(VLOOKUP($C48,'Product Information'!$A$2:$C$31,2),\"\")","v":""},{"$f":"_xlfn.IFNA(VLOOKUP($C48,'Product Information'!$A$2:$C$31,3),\"\")","v":""}]
[null,null,{"$f":"IFERROR(VLOOKUP(VALUE($B$44),'Input Calculation'!$A$2:$AJ$29,19),\"\")","v":""},{"$f":"_xlfn.IFNA(VLOOKUP($C49,'Product Information'!$A$2:$C$31,2),\"\")","v":""},{"$f":"_xlfn.IFNA(VLOOKUP($C49,'Product Information'!$A$2:$C$31,3),\"\")","v":""}]
[null,null,{"$f":"IFERROR(VLOOKUP(VALUE($B$44),'Input Calculation'!$A$2:$AJ$29,21),\"\")","v":""},{"$f":"_xlfn.IFNA(VLOOKUP($C50,'Product Information'!$A$2:$C$31,2),\"\")","v":""},{"$f":"_xlfn.IFNA(VLOOKUP($C50,'Product Information'!$A$2:$C$31,3),\"\")","v":""}]
[null,null,{"$f":"IFERROR(VLOOKUP(VALUE($B$44),'Input Calculation'!$A$2:$AJ$29,23),\"\")","v":""},{"$f":"_xlfn.IFNA(VLOOKUP($C51,'Product Information'!$A$2:$C$31,2),\"\")","v":""},{"$f":"_xlfn.IFNA(VLOOKUP($C51,'Product Information'!$A$2:$C$31,3),\"\")","v":""}]
[null,null,{"$f":"IFERROR(VLOOKUP(VALUE($B$44),'Input Calculation'!$A$2:$AJ$29,25),\"\")","v":""},{"$f":"_xlfn.IFNA(VLOOKUP($C52,'Product Information'!$A$2:$C$31,2),\"\")","v":""},{"$f":"_xlfn.IFNA(VLOOKUP($C52,'Product Information'!$A$2:$C$31,3),\"\")","v":""}]
[null,null,{"$f":"IFERROR(VLOOKUP(VALUE($B$44),'Input Calculation'!$A$2:$AJ$29,27),\"\")","v":""},{"$f":"_xlfn.IFNA(VLOOKUP($C53,'Product Information'!$A$2:$C$31,2),\"\")","v":""},{"$f":"_xlfn.IFNA(VLOOKUP($C53,'Product Information'!$A$2:$C$31,3),\"\")","v":""}]
[null,null,null,"Total:",{"$f":"IFERROR(VLOOKUP(VALUE($B$44),'Input Calculation'!$A$2:$AJ$29,36),\"\")","v":""},"Notes: "]
[]
[null,{"$f":"MID($A$7,LEN(B8)+LEN(B20)+LEN(B32)+LEN(B44)+1,4)","v":""},{"$f":"IFERROR(VLOOKUP(VALUE($B$56),'Input Calculation'!$A$2:$AJ$29,9),\"\")","v":""},{"$f":"_xlfn.IFNA(VLOOKUP($C56,'Product Information'!$A$2:$C$31,2),\"\")","v":""},{"$f":"_xlfn.IFNA(VLOOKUP($C56,'Product Information'!$A$2:$C$31,3),\"\")","v":""}]
[null,null,{"$f":"IFERROR(VLOOKUP(VALUE($B$56),'Input Calculation'!$A$2:$AJ$29,11),\"\")","v":""},{"$f":"_xlfn.IFNA(VLOOKUP($C57,'Product Information'!$A$2:$C$31,2),\"\")","v":""},{"$f":"_xlfn.IFNA(VLOOKUP($C57,'Product Information'!$A$2:$C$31,3),\"\")","v":""}]
[null,null,{"$f":"IFERROR(VLOOKUP(VALUE($B$56),'Input Calculation'!$A$2:$AJ$29,13),\"\")","v":""},{"$f":"_xlfn.IFNA(VLOOKUP($C58,'Product Information'!$A$2:$C$31,2),\"\")","v":""},{"$f":"_xlfn.IFNA(VLOOKUP($C58,'Product Information'!$A$2:$C$31,3),\"\")","v":""}]
[null,null,{"$f":"IFERROR(VLOOKUP(VALUE($B$56),'Input Calculation'!$A$2:$AJ$29,15),\"\")","v":""},{"$f":"_xlfn.IFNA(VLOOKUP($C59,'Product Information'!$A$2:$C$31,2),\"\")","v":""},{"$f":"_xlfn.IFNA(VLOOKUP($C59,'Product Information'!$A$2:$C$31,3),\"\")","v":""}]
[null,null,{"$f":"IFERROR(VLOOKUP(VALUE($B$56),'Input Calculation'!$A$2:$AJ$29,17),\"\")","v":""},{"$f":"_xlfn.IFNA(VLOOKUP($C60,'Product Information'!$A$2:$C$31,2),\"\")","v":""},{"$f":"_xlfn.IFNA(VLOOKUP($C60,'Product Information'!$A$2:$C$31,3),\"\")","v":""}]
[null,null,{"$f":"IFERROR(VLOOKUP(VALUE($B$56),'Input Calculation'!$A$2:$AJ$29,19),\"\")","v":""},{"$f":"_xlfn.IFNA(VLOOKUP($C61,'Product Information'!$A$2:$C$31,2),\"\")","v":""},{"$f":"_xlfn.IFNA(VLOOKUP($C61,'Product Information'!$A$2:$C$31,3),\"\")","v":""}]
[null,null,{"$f":"IFERROR(VLOOKUP(VALUE($B$56),'Input Calculation'!$A$2:$AJ$29,21),\"\")","v":""},{"$f":"_xlfn.IFNA(VLOOKUP($C62,'Product Information'!$A$2:$C$31,2),\"\")","v":""},{"$f":"_xlfn.IFNA(VLOOKUP($C62,'Product Information'!$A$2:$C$31,3),\"\")","v":""}]
[null,null,{"$f":"IFERROR(VLOOKUP(VALUE($B$56),'Input Calculation'!$A$2:$AJ$29,23),\"\")","v":""},{"$f":"_xlfn.IFNA(VLOOKUP($C63,'Product Information'!$A$2:$C$31,2),\"\")","v":""},{"$f":"_xlfn.IFNA(VLOOKUP($C63,'Product Information'!$A$2:$C$31,3),\"\")","v":""}]
[null,null,{"$f":"IFERROR(VLOOKUP(VALUE($B$56),'Input Calculation'!$A$2:$AJ$29,25),\"\")","v":""},{"$f":"_xlfn.IFNA(VLOOKUP($C64,'Product Information'!$A$2:$C$31,2),\"\")","v":""},{"$f":"_xlfn.IFNA(VLOOKUP($C64,'Product Information'!$A$2:$C$31,3),\"\")","v":""}]
[null,null,{"$f":"IFERROR(VLOOKUP(VALUE($B$56),'Input Calculation'!$A$2:$AJ$29,27),\"\")","v":""},{"$f":"_xlfn.IFNA(VLOOKUP($C65,'Product Information'!$A$2:$C$31,2),\"\")","v":""},{"$f":"_xlfn.IFNA(VLOOKUP($C65,'Product Information'!$A$2:$C$31,3),\"\")","v":""}]
[null,null,null,"Total:",{"$f":"IFERROR(VLOOKUP(VALUE($B$56),'Input Calculation'!$A$2:$AJ$29,36),\"\")","v":""},"Notes: "]
[null,{"$f":"MID($A$7,4*(ROW()-7),4)","v":""}]
[null,{"$f":"MID($A$7,LEN(B8)+LEN(B20)+LEN(B32)+LEN(B46)+LEN(B56)+1,4)","v":""},{"$f":"IFERROR(VLOOKUP(VALUE($B$68),'Input Calculation'!$A$2:$AJ$29,9),\"\")","v":""},{"$f":"_xlfn.IFNA(VLOOKUP($C68,'Product Information'!$A$2:$C$31,2),\"\")","v":""},{"$f":"_xlfn.IFNA(VLOOKUP($C68,'Product Information'!$A$2:$C$31,3),\"\")","v":""}]
[null,null,{"$f":"IFERROR(VLOOKUP(VALUE($B$68),'Input Calculation'!$A$2:$AJ$29,11),\"\")","v":""},{"$f":"_xlfn.IFNA(VLOOKUP($C69,'Product Information'!$A$2:$C$31,2),\"\")","v":""},{"$f":"_xlfn.IFNA(VLOOKUP($C69,'Product Information'!$A$2:$C$31,3),\"\")","v":""}]
[null,null,{"$f":"IFERROR(VLOOKUP(VALUE($B$68),'Input Calculation'!$A$2:$AJ$29,13),\"\")","v":""},{"$f":"_xlfn.IFNA(VLOOKUP($C70,'Product Information'!$A$2:$C$31,2),\"\")","v":""},{"$f":"_xlfn.IFNA(VLOOKUP($C70,'Product Information'!$A$2:$C$31,3),\"\")","v":""}]
[null,null,{"$f":"IFERROR(VLOOKUP(VALUE($B$68),'Input Calculation'!$A$2:$AJ$29,15),\"\")","v":""},{"$f":"_xlfn.IFNA(VLOOKUP($C71,'Product Information'!$A$2:$C$31,2),\"\")","v":""},{"$f":"_xlfn.IFNA(VLOOKUP($C71,'Product Information'!$A$2:$C$31,3),\"\")","v":""}]
[null,null,{"$f":"IFERROR(VLOOKUP(VALUE($B$68),'Input Calculation'!$A$2:$AJ$29,17),\"\")","v":""},{"$f":"_xlfn.IFNA(VLOOKUP($C72,'Product Information'!$A$2:$C$31,2),\"\")","v":""},{"$f":"_xlfn.IFNA(VLOOKUP($C72,'Product Information'!$A$2:$C$31,3),\"\")","v":""}]
[null,null,{"$f":"IFERROR(VLOOKUP(VALUE($B$68),'Input Calculation'!$A$2:$AJ$29,19),\"\")","v":""},{"$f":"_xlfn.IFNA(VLOOKUP($C73,'Product Information'!$A$2:$C$31,2),\"\")","v":""},{"$f":"_xlfn.IFNA(VLOOKUP($C73,'Product Information'!$A$2:$C$31,3),\"\")","v":""}]
[null,null,{"$f":"IFERROR(VLOOKUP(VALUE($B$68),'Input Calculation'!$A$2:$AJ$29,21),\"\")","v":""},{"$f":"_xlfn.IFNA(VLOOKUP($C74,'Product Information'!$A$2:$C$31,2),\"\")","v":""},{"$f":"_xlfn.IFNA(VLOOKUP($C74,'Product Information'!$A$2:$C$31,3),\"\")","v":""}]
[null,null,{"$f":"IFERROR(VLOOKUP(VALUE($B$68),'Input Calculation'!$A$2:$AJ$29,23),\"\")","v":""},{"$f":"_xlfn.IFNA(VLOOKUP($C75,'Product Information'!$A$2:$C$31,2),\"\")","v":""},{"$f":"_xlfn.IFNA(VLOOKUP($C75,'Product Information'!$A$2:$C$31,3),\"\")","v":""}]
[null,null,{"$f":"IFERROR(VLOOKUP(VALUE($B$68),'Input Calculation'!$A$2:$AJ$29,25),\"\")","v":""},{"$f":"_xlfn.IFNA(VLOOKUP($C76,'Product Information'!$A$2:$C$31,2),\"\")","v":""},{"$f":"_xlfn.IFNA(VLOOKUP($C76,'Product Information'!$A$2:$C$31,3),\"\")","v":""}]
[null,null,{"$f":"IFERROR(VLOOKUP(VALUE($B$68),'Input Calculation'!$A$2:$AJ$29,27),\"\")","v":""},{"$f":"_xlfn.IFNA(VLOOKUP($C77,'Product Information'!$A$2:$C$31,2),\"\")","v":""},{"$f":"_xlfn.IFNA(VLOOKUP($C77,'Product Information'!$A$2:$C$31,3),\"\")","v":""}]
[null,null,null,"Total:",{"$f":"IFERROR(VLOOKUP(VALUE($B$68),'Input Calculation'!$A$2:$AJ$29,36),\"\")","v":""},"Notes: "]
[null,{"$f":"MID($A$7,4*(ROW()-7),4)","v":""}]
[null,{"$f":"MID($A$7,4*(ROW()-7),4)","v":""}]

{"sheet":"6315790090","index":11,"n_rows":78,"n_cols":6,"rows_kept":78,"cut":false,"hidden":true,"merged":[]}
["Name:",{"$f":"VLOOKUP(6315790090,'Customer Information'!$A$2:$I$12,2)","v":"Caputo Matthew"}]
["Phone:",{"$f":"TEXT(6315790090,\"###-###-####\")","v":"631-579-0090"}]
["Email:",{"$f":"VLOOKUP(6315790090,'Customer Information'!$A$2:$I$12,3)","v":"mattcap62480@gmail.com"}]
["Address:",{"$f":"CONCATENATE(VLOOKUP(6315790090,'Customer Information'!$A$2:$I$12,4),\", \",VLOOKUP(6315790090,'Customer Information'!$A$2:$I$12,5),\", \",VLOOKUP(6315790090,'Customer Information'!$A$2:$I$12,6),\" \",VLOOKUP(6315790090,'Customer Information'!$A$2:$I$12,7))","v":"7123 Montclair Peak Lane, Richmond, TX 77469"}]
["Customer Since:",{"$f":"VLOOKUP(6315790090,'Customer Information'!$A$2:$I$12,8)","v":2007}]
["Good Standing:",{"$f":"VLOOKUP(6315790090,'Customer Information'!$A$2:$I$12,9)","v":"Yes"}]
[{"$f":"CONCATENATE(A8,A9,A10,A11,A12,A13,A14,A15,A16,A17,A18,A19,A20,A21,A22,A23,A24,A25,A26,A27,A28,A29,A30,A31,A32,A33,A34,A35,A36)","v":"1001101510201023"},"Order Number"]
[{"$f":"IF('Input Calculation'!B2=6315790090,'Input Calculation'!A2,\"\")","v":1001},{"$f":"MID($A$7,ROW()-7,4)","v":"1001"},{"$f":"IFERROR(VLOOKUP(VALUE($B$8),'Input Calculation'!$A$2:$AJ$29,9),\"\")","v":7250412},{"$f":"_xlfn.IFNA(VLOOKUP($C8,'Product Information'!$A$2:$C$31,2),\"\")","v":"Thermal Socks"},{"$f":"_xlfn.IFNA(VLOOKUP($C8,'Product Information'!$A$2:$C$31,3),\"\")","v":12.99}]
[{"$f":"IF('Input Calculation'!B3=6315790090,'Input Calculation'!A3,\"\")","v":""},null,{"$f":"IFERROR(VLOOKUP(VALUE($B$8),'Input Calculation'!$A$2:$AJ$29,11),\"\")","v":5216388},{"$f":"_xlfn.IFNA(VLOOKUP($C9,'Product Information'!$A$2:$C$31,2),\"\")","v":"Logo Hat"},{"$f":"_xlfn.IFNA(VLOOKUP($C9,'Product Information'!$A$2:$C$31,3),\"\")","v":49.99}]
[{"$f":"IF('Input Calculation'!B4=6315790090,'Input Calculation'!A4,\"\")","v":""},null,{"$f":"IFERROR(VLOOKUP(VALUE($B$8),'Input Calculation'!$A$2:$AJ$29,13),\"\")","v":9242514},{"$f":"_xlfn.IFNA(VLOOKUP($C10,'Product Information'!$A$2:$C$31,2),\"\")","v":"Fashionista Sunglasses"},{"$f":"_xlfn.IFNA(VLOOKUP($C10,'Product Information'!$A$2:$C$31,3),\"\")","v":499.99}]
[{"$f":"IF('Input Calculation'!B5=6315790090,'Input Calculation'!A5,\"\")","v":""},null,{"$f":"IFERROR(VLOOKUP(VALUE($B$8),'Input Calculation'!$A$2:$AJ$29,15),\"\")","v":""},{"$f":"_xlfn.IFNA(VLOOKUP($C11,'Product Information'!$A$2:$C$31,2),\"\")","v":""},{"$f":"_xlfn.IFNA(VLOOKUP($C11,'Product Information'!$A$2:$C$31,3),\"\")","v":""}]
[{"$f":"IF('Input Calculation'!B6=6315790090,'Input Calculation'!A6,\"\")","v":""},null,{"$f":"IFERROR(VLOOKUP(VALUE($B$8),'Input Calculation'!$A$2:$AJ$29,17),\"\")","v":""},{"$f":"_xlfn.IFNA(VLOOKUP($C12,'Product Information'!$A$2:$C$31,2),\"\")","v":""},{"$f":"_xlfn.IFNA(VLOOKUP($C12,'Product Information'!$A$2:$C$31,3),\"\")","v":""}]
[{"$f":"IF('Input Calculation'!B7=6315790090,'Input Calculation'!A7,\"\")","v":""},null,{"$f":"IFERROR(VLOOKUP(VALUE($B$8),'Input Calculation'!$A$2:$AJ$29,19),\"\")","v":""},{"$f":"_xlfn.IFNA(VLOOKUP($C13,'Product Information'!$A$2:$C$31,2),\"\")","v":""},{"$f":"_xlfn.IFNA(VLOOKUP($C13,'Product Information'!$A$2:$C$31,3),\"\")","v":""}]
[{"$f":"IF('Input Calculation'!B8=6315790090,'Input Calculation'!A8,\"\")","v":""},null,{"$f":"IFERROR(VLOOKUP(VALUE($B$8),'Input Calculation'!$A$2:$AJ$29,21),\"\")","v":""},{"$f":"_xlfn.IFNA(VLOOKUP($C14,'Product Information'!$A$2:$C$31,2),\"\")","v":""},{"$f":"_xlfn.IFNA(VLOOKUP($C14,'Product Information'!$A$2:$C$31,3),\"\")","v":""}]
[{"$f":"IF('Input Calculation'!B9=6315790090,'Input Calculation'!A9,\"\")","v":""},null,{"$f":"IFERROR(VLOOKUP(VALUE($B$8),'Input Calculation'!$A$2:$AJ$29,23),\"\")","v":""},{"$f":"_xlfn.IFNA(VLOOKUP($C15,'Product Information'!$A$2:$C$31,2),\"\")","v":""},{"$f":"_xlfn.IFNA(VLOOKUP($C15,'Product Information'!$A$2:$C$31,3),\"\")","v":""}]
[{"$f":"IF('Input Calculation'!B10=6315790090,'Input Calculation'!A10,\"\")","v":""},null,{"$f":"IFERROR(VLOOKUP(VALUE($B$8),'Input Calculation'!$A$2:$AJ$29,25),\"\")","v":""},{"$f":"_xlfn.IFNA(VLOOKUP($C16,'Product Information'!$A$2:$C$31,2),\"\")","v":""},{"$f":"_xlfn.IFNA(VLOOKUP($C16,'Product Information'!$A$2:$C$31,3),\"\")","v":""}]
[{"$f":"IF('Input Calculation'!B11=6315790090,'Input Calculation'!A11,\"\")","v":""},null,{"$f":"IFERROR(VLOOKUP(VALUE($B$8),'Input Calculation'!$A$2:$AJ$29,27),\"\")","v":""},{"$f":"_xlfn.IFNA(VLOOKUP($C17,'Product Information'!$A$2:$C$31,2),\"\")","v":""},{"$f":"_xlfn.IFNA(VLOOKUP($C17,'Product Information'!$A$2:$C$31,3),\"\")","v":""}]
[{"$f":"IF('Input Calculation'!B12=6315790090,'Input Calculation'!A12,\"\")","v":""},null,null,"Total:",{"$f":"VLOOKUP(VALUE($B$8),'Input Calculation'!$A$2:$AJ$29,36)","v":548.16999999999996},"Notes: "]
[{"$f":"IF('Input Calculation'!B13=6315790090,'Input Calculation'!A13,\"\")","v":""}]
[{"$f":"IF('Input Calculation'!B14=6315790090,'Input Calculation'!A14,\"\")","v":""},{"$f":"MID($A$7,LEN(B8)+1,4)","v":"1015"},{"$f":"IFERROR(VLOOKUP(VALUE($B$20),'Input Calculation'!$A$2:$AJ$29,9),\"\")","v":5216388},{"$f":"_xlfn.IFNA(VLOOKUP($C20,'Product Information'!$A$2:$C$31,2),\"\")","v":"Logo Hat"},{"$f":"_xlfn.IFNA(VLOOKUP($C20,'Product Information'!$A$2:$C$31,3),\"\")","v":49.99}]
[{"$f":"IF('Input Calculation'!B15=6315790090,'Input Calculation'!A15,\"\")","v":""},null,{"$f":"IFERROR(VLOOKUP(VALUE($B$20),'Input Calculation'!$A$2:$AJ$29,11),\"\")","v":""},{"$f":"_xlfn.IFNA(VLOOKUP($C21,'Product Information'!$A$2:$C$31,2),\"\")","v":""},{"$f":"_xlfn.IFNA(VLOOKUP($C21,'Product Information'!$A$2:$C$31,3),\"\")","v":""}]
[{"$f":"IF('Input Calculation'!B16=6315790090,'Input Calculation'!A16,\"\")","v":1015},null,{"$f":"IFERROR(VLOOKUP(VALUE($B$20),'Input Calculation'!$A$2:$AJ$29,13),\"\")","v":""},{"$f":"_xlfn.IFNA(VLOOKUP($C22,'Product Information'!$A$2:$C$31,2),\"\")","v":""},{"$f":"_xlfn.IFNA(VLOOKUP($C22,'Product Information'!$A$2:$C$31,3),\"\")","v":""}]
[{"$f":"IF('Input Calculation'!B17=6315790090,'Input Calculation'!A17,\"\")","v":""},null,{"$f":"IFERROR(VLOOKUP(VALUE($B$20),'Input Calculation'!$A$2:$AJ$29,15),\"\")","v":""},{"$f":"_xlfn.IFNA(VLOOKUP($C23,'Product Information'!$A$2:$C$31,2),\"\")","v":""},{"$f":"_xlfn.IFNA(VLOOKUP($C23,'Product Information'!$A$2:$C$31,3),\"\")","v":""}]
[{"$f":"IF('Input Calculation'!B18=6315790090,'Input Calculation'!A18,\"\")","v":""},null,{"$f":"IFERROR(VLOOKUP(VALUE($B$20),'Input Calculation'!$A$2:$AJ$29,17),\"\")","v":""},{"$f":"_xlfn.IFNA(VLOOKUP($C24,'Product Information'!$A$2:$C$31,2),\"\")","v":""},{"$f":"_xlfn.IFNA(VLOOKUP($C24,'Product Information'!$A$2:$C$31,3),\"\")","v":""}]
[{"$f":"IF('Input Calculation'!B19=6315790090,'Input Calculation'!A19,\"\")","v":""},null,{"$f":"IFERROR(VLOOKUP(VALUE($B$20),'Input Calculation'!$A$2:$AJ$29,19),\"\")","v":""},{"$f":"_xlfn.IFNA(VLOOKUP($C25,'Product Information'!$A$2:$C$31,2),\"\")","v":""},{"$f":"_xlfn.IFNA(VLOOKUP($C25,'Product Information'!$A$2:$C$31,3),\"\")","v":""}]
[{"$f":"IF('Input Calculation'!B20=6315790090,'Input Calculation'!A20,\"\")","v":""},null,{"$f":"IFERROR(VLOOKUP(VALUE($B$20),'Input Calculation'!$A$2:$AJ$29,21),\"\")","v":""},{"$f":"_xlfn.IFNA(VLOOKUP($C26,'Product Information'!$A$2:$C$31,2),\"\")","v":""},{"$f":"_xlfn.IFNA(VLOOKUP($C26,'Product Information'!$A$2:$C$31,3),\"\")","v":""}]
[{"$f":"IF('Input Calculation'!B21=6315790090,'Input Calculation'!A21,\"\")","v":1020},null,{"$f":"IFERROR(VLOOKUP(VALUE($B$20),'Input Calculation'!$A$2:$AJ$29,23),\"\")","v":""},{"$f":"_xlfn.IFNA(VLOOKUP($C27,'Product Information'!$A$2:$C$31,2),\"\")","v":""},{"$f":"_xlfn.IFNA(VLOOKUP($C27,'Product Information'!$A$2:$C$31,3),\"\")","v":""}]
[{"$f":"IF('Input Calculation'!B22=6315790090,'Input Calculation'!A22,\"\")","v":""},null,{"$f":"IFERROR(VLOOKUP(VALUE($B$20),'Input Calculation'!$A$2:$AJ$29,25),\"\")","v":""},{"$f":"_xlfn.IFNA(VLOOKUP($C28,'Product Information'!$A$2:$C$31,2),\"\")","v":""},{"$f":"_xlfn.IFNA(VLOOKUP($C28,'Product Information'!$A$2:$C$31,3),\"\")","v":""}]
[{"$f":"IF('Input Calculation'!B23=6315790090,'Input Calculation'!A23,\"\")","v":""},null,{"$f":"IFERROR(VLOOKUP(VALUE($B$20),'Input Calculation'!$A$2:$AJ$29,27),\"\")","v":""},{"$f":"_xlfn.IFNA(VLOOKUP($C29,'Product Information'!$A$2:$C$31,2),\"\")","v":""},{"$f":"_xlfn.IFNA(VLOOKUP($C29,'Product Information'!$A$2:$C$31,3),\"\")","v":""}]
[{"$f":"IF('Input Calculation'!B24=6315790090,'Input Calculation'!A24,\"\")","v":1023},null,null,"Total:",{"$f":"IFERROR(VLOOKUP(VALUE($B$20),'Input Calculation'!$A$2:$AJ$29,36),\"\")","v":48.68},"Notes: "]
[{"$f":"IF('Input Calculation'!B25=6315790090,'Input Calculation'!A25,\"\")","v":""}]
[{"$f":"IF('Input Calculation'!B26=6315790090,'Input Calculation'!A26,\"\")","v":""},{"$f":"MID($A$7,LEN(B8)+LEN(B20)+1,4)","v":"1020"},{"$f":"IFERROR(VLOOKUP(VALUE($B$32),'Input Calculation'!$A$2:$AJ$29,9),\"\")","v":8924251},{"$f":"_xlfn.IFNA(VLOOKUP($C32,'Product Information'!$A$2:$C$31,2),\"\")","v":"Super Sunglasses"},{"$f":"_xlfn.IFNA(VLOOKUP($C32,'Product Information'!$A$2:$C$31,3),\"\")","v":99.99}]
[{"$f":"IF('Input Calculation'!B27=6315790090,'Input Calculation'!A27,\"\")","v":""},null,{"$f":"IFERROR(VLOOKUP(VALUE($B$32),'Input Calculation'!$A$2:$AJ$29,11),\"\")","v":5216388},{"$f":"_xlfn.IFNA(VLOOKUP($C33,'Product Information'!$A$2:$C$31,2),\"\")","v":"Logo Hat"},{"$f":"_xlfn.IFNA(VLOOKUP($C33,'Product Information'!$A$2:$C$31,3),\"\")","v":49.99}]
[{"$f":"IF('Input Calculation'!B28=6315790090,'Input Calculation'!A28,\"\")","v":""},null,{"$f":"IFERROR(VLOOKUP(VALUE($B$32),'Input Calculation'!$A$2:$AJ$29,13),\"\")","v":""},{"$f":"_xlfn.IFNA(VLOOKUP($C34,'Product Information'!$A$2:$C$31,2),\"\")","v":""},{"$f":"_xlfn.IFNA(VLOOKUP($C34,'Product Information'!$A$2:$C$31,3),\"\")","v":""}]
[{"$f":"IF('Input Calculation'!B29=6315790090,'Input Calculation'!A29,\"\")","v":""},null,{"$f":"IFERROR(VLOOKUP(VALUE($B$32),'Input Calculation'!$A$2:$AJ$29,15),\"\")","v":""},{"$f":"_xlfn.IFNA(VLOOKUP($C35,'Product Information'!$A$2:$C$31,2),\"\")","v":""},{"$f":"_xlfn.IFNA(VLOOKUP($C35,'Product Information'!$A$2:$C$31,3),\"\")","v":""}]
[{"$f":"IF('Input Calculation'!B30=6315790090,'Input Calculation'!A30,\"\")","v":""},null,{"$f":"IFERROR(VLOOKUP(VALUE($B$32),'Input Calculation'!$A$2:$AJ$29,17),\"\")","v":""},{"$f":"_xlfn.IFNA(VLOOKUP($C36,'Product Information'!$A$2:$C$31,2),\"\")","v":""},{"$f":"_xlfn.IFNA(VLOOKUP($C36,'Product Information'!$A$2:$C$31,3),\"\")","v":""}]
[null,null,{"$f":"IFERROR(VLOOKUP(VALUE($B$32),'Input Calculation'!$A$2:$AJ$29,19),\"\")","v":""},{"$f":"_xlfn.IFNA(VLOOKUP($C37,'Product Information'!$A$2:$C$31,2),\"\")","v":""},{"$f":"_xlfn.IFNA(VLOOKUP($C37,'Product Information'!$A$2:$C$31,3),\"\")","v":""}]
[null,null,{"$f":"IFERROR(VLOOKUP(VALUE($B$32),'Input Calculation'!$A$2:$AJ$29,21),\"\")","v":""},{"$f":"_xlfn.IFNA(VLOOKUP($C38,'Product Information'!$A$2:$C$31,2),\"\")","v":""},{"$f":"_xlfn.IFNA(VLOOKUP($C38,'Product Information'!$A$2:$C$31,3),\"\")","v":""}]
[null,null,{"$f":"IFERROR(VLOOKUP(VALUE($B$32),'Input Calculation'!$A$2:$AJ$29,23),\"\")","v":""},{"$f":"_xlfn.IFNA(VLOOKUP($C39,'Product Information'!$A$2:$C$31,2),\"\")","v":""},{"$f":"_xlfn.IFNA(VLOOKUP($C39,'Product Information'!$A$2:$C$31,3),\"\")","v":""}]
[null,null,{"$f":"IFERROR(VLOOKUP(VALUE($B$32),'Input Calculation'!$A$2:$AJ$29,25),\"\")","v":""},{"$f":"_xlfn.IFNA(VLOOKUP($C40,'Product Information'!$A$2:$C$31,2),\"\")","v":""},{"$f":"_xlfn.IFNA(VLOOKUP($C40,'Product Information'!$A$2:$C$31,3),\"\")","v":""}]
[null,null,{"$f":"IFERROR(VLOOKUP(VALUE($B$32),'Input Calculation'!$A$2:$AJ$29,27),\"\")","v":""},{"$f":"_xlfn.IFNA(VLOOKUP($C41,'Product Information'!$A$2:$C$31,2),\"\")","v":""},{"$f":"_xlfn.IFNA(VLOOKUP($C41,'Product Information'!$A$2:$C$31,3),\"\")","v":""}]
[null,null,null,"Total:",{"$f":"IFERROR(VLOOKUP(VALUE($B$32),'Input Calculation'!$A$2:$AJ$29,36),\"\")","v":146.04},"Notes: "]
[]
[null,{"$f":"MID($A$7,LEN(B8)+LEN(B20)+LEN(B32)+1,4)","v":"1023"},{"$f":"IFERROR(VLOOKUP(VALUE($B$44),'Input Calculation'!$A$2:$AJ$29,9),\"\")","v":7250412},{"$f":"_xlfn.IFNA(VLOOKUP($C44,'Product Information'!$A$2:$C$31,2),\"\")","v":"Thermal Socks"},{"$f":"_xlfn.IFNA(VLOOKUP($C44,'Product Information'!$A$2:$C$31,3),\"\")","v":12.99}]
[null,null,{"$f":"IFERROR(VLOOKUP(VALUE($B$44),'Input Calculation'!$A$2:$AJ$29,11),\"\")","v":8924251},{"$f":"_xlfn.IFNA(VLOOKUP($C45,'Product Information'!$A$2:$C$31,2),\"\")","v":"Super Sunglasses"},{"$f":"_xlfn.IFNA(VLOOKUP($C45,'Product Information'!$A$2:$C$31,3),\"\")","v":99.99}]
[null,null,{"$f":"IFERROR(VLOOKUP(VALUE($B$44),'Input Calculation'!$A$2:$AJ$29,13),\"\")","v":""},{"$f":"_xlfn.IFNA(VLOOKUP($C46,'Product Information'!$A$2:$C$31,2),\"\")","v":""},{"$f":"_xlfn.IFNA(VLOOKUP($C46,'Product Information'!$A$2:$C$31,3),\"\")","v":""}]
[null,null,{"$f":"IFERROR(VLOOKUP(VALUE($B$44),'Input Calculation'!$A$2:$AJ$29,15),\"\")","v":""},{"$f":"_xlfn.IFNA(VLOOKUP($C47,'Product Information'!$A$2:$C$31,2),\"\")","v":""},{"$f":"_xlfn.IFNA(VLOOKUP($C47,'Product Information'!$A$2:$C$31,3),\"\")","v":""}]
[null,null,{"$f":"IFERROR(VLOOKUP(VALUE($B$44),'Input Calculation'!$A$2:$AJ$29,17),\"\")","v":""},{"$f":"_xlfn.IFNA(VLOOKUP($C48,'Product Information'!$A$2:$C$31,2),\"\")","v":""},{"$f":"_xlfn.IFNA(VLOOKUP($C48,'Product Information'!$A$2:$C$31,3),\"\")","v":""}]
[null,null,{"$f":"IFERROR(VLOOKUP(VALUE($B$44),'Input Calculation'!$A$2:$AJ$29,19),\"\")","v":""},{"$f":"_xlfn.IFNA(VLOOKUP($C49,'Product Information'!$A$2:$C$31,2),\"\")","v":""},{"$f":"_xlfn.IFNA(VLOOKUP($C49,'Product Information'!$A$2:$C$31,3),\"\")","v":""}]
[null,null,{"$f":"IFERROR(VLOOKUP(VALUE($B$44),'Input Calculation'!$A$2:$AJ$29,21),\"\")","v":""},{"$f":"_xlfn.IFNA(VLOOKUP($C50,'Product Information'!$A$2:$C$31,2),\"\")","v":""},{"$f":"_xlfn.IFNA(VLOOKUP($C50,'Product Information'!$A$2:$C$31,3),\"\")","v":""}]
[null,null,{"$f":"IFERROR(VLOOKUP(VALUE($B$44),'Input Calculation'!$A$2:$AJ$29,23),\"\")","v":""},{"$f":"_xlfn.IFNA(VLOOKUP($C51,'Product Information'!$A$2:$C$31,2),\"\")","v":""},{"$f":"_xlfn.IFNA(VLOOKUP($C51,'Product Information'!$A$2:$C$31,3),\"\")","v":""}]
[null,null,{"$f":"IFERROR(VLOOKUP(VALUE($B$44),'Input Calculation'!$A$2:$AJ$29,25),\"\")","v":""},{"$f":"_xlfn.IFNA(VLOOKUP($C52,'Product Information'!$A$2:$C$31,2),\"\")","v":""},{"$f":"_xlfn.IFNA(VLOOKUP($C52,'Product Information'!$A$2:$C$31,3),\"\")","v":""}]
[null,null,{"$f":"IFERROR(VLOOKUP(VALUE($B$44),'Input Calculation'!$A$2:$AJ$29,27),\"\")","v":""},{"$f":"_xlfn.IFNA(VLOOKUP($C53,'Product Information'!$A$2:$C$31,2),\"\")","v":""},{"$f":"_xlfn.IFNA(VLOOKUP($C53,'Product Information'!$A$2:$C$31,3),\"\")","v":""}]
[null,null,null,"Total:",{"$f":"IFERROR(VLOOKUP(VALUE($B$44),'Input Calculation'!$A$2:$AJ$29,36),\"\")","v":110.00999999999999},"Notes: "]
[]
[null,{"$f":"MID($A$7,LEN(B8)+LEN(B20)+LEN(B32)+LEN(B44)+1,4)","v":""},{"$f":"IFERROR(VLOOKUP(VALUE($B$56),'Input Calculation'!$A$2:$AJ$29,9),\"\")","v":""},{"$f":"_xlfn.IFNA(VLOOKUP($C56,'Product Information'!$A$2:$C$31,2),\"\")","v":""},{"$f":"_xlfn.IFNA(VLOOKUP($C56,'Product Information'!$A$2:$C$31,3),\"\")","v":""}]
[null,null,{"$f":"IFERROR(VLOOKUP(VALUE($B$56),'Input Calculation'!$A$2:$AJ$29,11),\"\")","v":""},{"$f":"_xlfn.IFNA(VLOOKUP($C57,'Product Information'!$A$2:$C$31,2),\"\")","v":""},{"$f":"_xlfn.IFNA(VLOOKUP($C57,'Product Information'!$A$2:$C$31,3),\"\")","v":""}]
[null,null,{"$f":"IFERROR(VLOOKUP(VALUE($B$56),'Input Calculation'!$A$2:$AJ$29,13),\"\")","v":""},{"$f":"_xlfn.IFNA(VLOOKUP($C58,'Product Information'!$A$2:$C$31,2),\"\")","v":""},{"$f":"_xlfn.IFNA(VLOOKUP($C58,'Product Information'!$A$2:$C$31,3),\"\")","v":""}]
[null,null,{"$f":"IFERROR(VLOOKUP(VALUE($B$56),'Input Calculation'!$A$2:$AJ$29,15),\"\")","v":""},{"$f":"_xlfn.IFNA(VLOOKUP($C59,'Product Information'!$A$2:$C$31,2),\"\")","v":""},{"$f":"_xlfn.IFNA(VLOOKUP($C59,'Product Information'!$A$2:$C$31,3),\"\")","v":""}]
[null,null,{"$f":"IFERROR(VLOOKUP(VALUE($B$56),'Input Calculation'!$A$2:$AJ$29,17),\"\")","v":""},{"$f":"_xlfn.IFNA(VLOOKUP($C60,'Product Information'!$A$2:$C$31,2),\"\")","v":""},{"$f":"_xlfn.IFNA(VLOOKUP($C60,'Product Information'!$A$2:$C$31,3),\"\")","v":""}]
[null,null,{"$f":"IFERROR(VLOOKUP(VALUE($B$56),'Input Calculation'!$A$2:$AJ$29,19),\"\")","v":""},{"$f":"_xlfn.IFNA(VLOOKUP($C61,'Product Information'!$A$2:$C$31,2),\"\")","v":""},{"$f":"_xlfn.IFNA(VLOOKUP($C61,'Product Information'!$A$2:$C$31,3),\"\")","v":""}]
[null,null,{"$f":"IFERROR(VLOOKUP(VALUE($B$56),'Input Calculation'!$A$2:$AJ$29,21),\"\")","v":""},{"$f":"_xlfn.IFNA(VLOOKUP($C62,'Product Information'!$A$2:$C$31,2),\"\")","v":""},{"$f":"_xlfn.IFNA(VLOOKUP($C62,'Product Information'!$A$2:$C$31,3),\"\")","v":""}]
[null,null,{"$f":"IFERROR(VLOOKUP(VALUE($B$56),'Input Calculation'!$A$2:$AJ$29,23),\"\")","v":""},{"$f":"_xlfn.IFNA(VLOOKUP($C63,'Product Information'!$A$2:$C$31,2),\"\")","v":""},{"$f":"_xlfn.IFNA(VLOOKUP($C63,'Product Information'!$A$2:$C$31,3),\"\")","v":""}]
[null,null,{"$f":"IFERROR(VLOOKUP(VALUE($B$56),'Input Calculation'!$A$2:$AJ$29,25),\"\")","v":""},{"$f":"_xlfn.IFNA(VLOOKUP($C64,'Product Information'!$A$2:$C$31,2),\"\")","v":""},{"$f":"_xlfn.IFNA(VLOOKUP($C64,'Product Information'!$A$2:$C$31,3),\"\")","v":""}]
[null,null,{"$f":"IFERROR(VLOOKUP(VALUE($B$56),'Input Calculation'!$A$2:$AJ$29,27),\"\")","v":""},{"$f":"_xlfn.IFNA(VLOOKUP($C65,'Product Information'!$A$2:$C$31,2),\"\")","v":""},{"$f":"_xlfn.IFNA(VLOOKUP($C65,'Product Information'!$A$2:$C$31,3),\"\")","v":""}]
[null,null,null,"Total:",{"$f":"IFERROR(VLOOKUP(VALUE($B$56),'Input Calculation'!$A$2:$AJ$29,36),\"\")","v":""},"Notes: "]
[]
[null,{"$f":"MID($A$7,LEN(B8)+LEN(B20)+LEN(B32)+LEN(B44)+LEN(B56)+1,4)","v":""},{"$f":"IFERROR(VLOOKUP(VALUE($B$68),'Input Calculation'!$A$2:$AJ$29,9),\"\")","v":""},{"$f":"_xlfn.IFNA(VLOOKUP($C68,'Product Information'!$A$2:$C$31,2),\"\")","v":""},{"$f":"_xlfn.IFNA(VLOOKUP($C68,'Product Information'!$A$2:$C$31,3),\"\")","v":""}]
[null,null,{"$f":"IFERROR(VLOOKUP(VALUE($B$68),'Input Calculation'!$A$2:$AJ$29,11),\"\")","v":""},{"$f":"_xlfn.IFNA(VLOOKUP($C69,'Product Information'!$A$2:$C$31,2),\"\")","v":""},{"$f":"_xlfn.IFNA(VLOOKUP($C69,'Product Information'!$A$2:$C$31,3),\"\")","v":""}]
[null,null,{"$f":"IFERROR(VLOOKUP(VALUE($B$68),'Input Calculation'!$A$2:$AJ$29,13),\"\")","v":""},{"$f":"_xlfn.IFNA(VLOOKUP($C70,'Product Information'!$A$2:$C$31,2),\"\")","v":""},{"$f":"_xlfn.IFNA(VLOOKUP($C70,'Product Information'!$A$2:$C$31,3),\"\")","v":""}]
[null,null,{"$f":"IFERROR(VLOOKUP(VALUE($B$68),'Input Calculation'!$A$2:$AJ$29,15),\"\")","v":""},{"$f":"_xlfn.IFNA(VLOOKUP($C71,'Product Information'!$A$2:$C$31,2),\"\")","v":""},{"$f":"_xlfn.IFNA(VLOOKUP($C71,'Product Information'!$A$2:$C$31,3),\"\")","v":""}]
[null,null,{"$f":"IFERROR(VLOOKUP(VALUE($B$68),'Input Calculation'!$A$2:$AJ$29,17),\"\")","v":""},{"$f":"_xlfn.IFNA(VLOOKUP($C72,'Product Information'!$A$2:$C$31,2),\"\")","v":""},{"$f":"_xlfn.IFNA(VLOOKUP($C72,'Product Information'!$A$2:$C$31,3),\"\")","v":""}]
[null,null,{"$f":"IFERROR(VLOOKUP(VALUE($B$68),'Input Calculation'!$A$2:$AJ$29,19),\"\")","v":""},{"$f":"_xlfn.IFNA(VLOOKUP($C73,'Product Information'!$A$2:$C$31,2),\"\")","v":""},{"$f":"_xlfn.IFNA(VLOOKUP($C73,'Product Information'!$A$2:$C$31,3),\"\")","v":""}]
[null,null,{"$f":"IFERROR(VLOOKUP(VALUE($B$68),'Input Calculation'!$A$2:$AJ$29,21),\"\")","v":""},{"$f":"_xlfn.IFNA(VLOOKUP($C74,'Product Information'!$A$2:$C$31,2),\"\")","v":""},{"$f":"_xlfn.IFNA(VLOOKUP($C74,'Product Information'!$A$2:$C$31,3),\"\")","v":""}]
[null,null,{"$f":"IFERROR(VLOOKUP(VALUE($B$68),'Input Calculation'!$A$2:$AJ$29,23),\"\")","v":""},{"$f":"_xlfn.IFNA(VLOOKUP($C75,'Product Information'!$A$2:$C$31,2),\"\")","v":""},{"$f":"_xlfn.IFNA(VLOOKUP($C75,'Product Information'!$A$2:$C$31,3),\"\")","v":""}]
[null,null,{"$f":"IFERROR(VLOOKUP(VALUE($B$68),'Input Calculation'!$A$2:$AJ$29,25),\"\")","v":""},{"$f":"_xlfn.IFNA(VLOOKUP($C76,'Product Information'!$A$2:$C$31,2),\"\")","v":""},{"$f":"_xlfn.IFNA(VLOOKUP($C76,'Product Information'!$A$2:$C$31,3),\"\")","v":""}]
[null,null,{"$f":"IFERROR(VLOOKUP(VALUE($B$68),'Input Calculation'!$A$2:$AJ$29,27),\"\")","v":""},{"$f":"_xlfn.IFNA(VLOOKUP($C77,'Product Information'!$A$2:$C$31,2),\"\")","v":""},{"$f":"_xlfn.IFNA(VLOOKUP($C77,'Product Information'!$A$2:$C$31,3),\"\")","v":""}]
[null,null,null,"Total:",{"$f":"IFERROR(VLOOKUP(VALUE($B$68),'Input Calculation'!$A$2:$AJ$29,36),\"\")","v":""},"Notes: "]

{"sheet":"6530353532","index":12,"n_rows":78,"n_cols":6,"rows_kept":78,"cut":false,"hidden":true,"merged":[]}
["Name:",{"$f":"VLOOKUP(6530353532,'Customer Information'!$A$2:$I$12,2)","v":"Pumpkineater Peter"}]
["Phone:",{"$f":"TEXT(6530353532,\"###-###-####\")","v":"653-035-3532"}]
["Email:",{"$f":"VLOOKUP(6530353532,'Customer Information'!$A$2:$I$12,3)","v":"Orange@mail.com"}]
["Address:",{"$f":"CONCATENATE(VLOOKUP(6530353532,'Customer Information'!$A$2:$I$12,4),\", \",VLOOKUP(6530353532,'Customer Information'!$A$2:$I$12,5),\", \",VLOOKUP(6530353532,'Customer Information'!$A$2:$I$12,6),\" \",VLOOKUP(6530353532,'Customer Information'!$A$2:$I$12,7))","v":"32 Maple Road, Bloomington, VT 8876"}]
["Customer Since:",{"$f":"VLOOKUP(6530353532,'Customer Information'!$A$2:$I$12,8)","v":2008}]
["Good Standing:",{"$f":"VLOOKUP(6530353532,'Customer Information'!$A$2:$I$12,9)","v":"Yes"}]
[{"$f":"CONCATENATE(A8,A9,A10,A11,A12,A13,A14,A15,A16,A17,A18,A19,A20,A21,A22,A23,A24,A25,A26,A27,A28,A29,A30,A31,A32,A33,A34,A35,A36)","v":"100610101022"},"Order Number"]
[{"$f":"IF('Input Calculation'!B2=6530353532,'Input Calculation'!A2,\"\")","v":""},{"$f":"MID($A$7,ROW()-7,4)","v":"1006"},{"$f":"IFERROR(VLOOKUP(VALUE($B$8),'Input Calculation'!$A$2:$AJ$29,9),\"\")","v":8924251},{"$f":"_xlfn.IFNA(VLOOKUP($C8,'Product Information'!$A$2:$C$31,2),\"\")","v":"Super Sunglasses"},{"$f":"_xlfn.IFNA(VLOOKUP($C8,'Product Information'!$A$2:$C$31,3),\"\")","v":99.99}]
[{"$f":"IF('Input Calculation'!B3=6530353532,'Input Calculation'!A3,\"\")","v":""},null,{"$f":"IFERROR(VLOOKUP(VALUE($B$8),'Input Calculation'!$A$2:$AJ$29,11),\"\")","v":7250412},{"$f":"_xlfn.IFNA(VLOOKUP($C9,'Product Information'!$A$2:$C$31,2),\"\")","v":"Thermal Socks"},{"$f":"_xlfn.IFNA(VLOOKUP($C9,'Product Information'!$A$2:$C$31,3),\"\")","v":12.99}]
[{"$f":"IF('Input Calculation'!B4=6530353532,'Input Calculation'!A4,\"\")","v":""},null,{"$f":"IFERROR(VLOOKUP(VALUE($B$8),'Input Calculation'!$A$2:$AJ$29,13),\"\")","v":8924251},{"$f":"_xlfn.IFNA(VLOOKUP($C10,'Product Information'!$A$2:$C$31,2),\"\")","v":"Super Sunglasses"},{"$f":"_xlfn.IFNA(VLOOKUP($C10,'Product Information'!$A$2:$C$31,3),\"\")","v":99.99}]
[{"$f":"IF('Input Calculation'!B5=6530353532,'Input Calculation'!A5,\"\")","v":""},null,{"$f":"IFERROR(VLOOKUP(VALUE($B$8),'Input Calculation'!$A$2:$AJ$29,15),\"\")","v":""},{"$f":"_xlfn.IFNA(VLOOKUP($C11,'Product Information'!$A$2:$C$31,2),\"\")","v":""},{"$f":"_xlfn.IFNA(VLOOKUP($C11,'Product Information'!$A$2:$C$31,3),\"\")","v":""}]
[{"$f":"IF('Input Calculation'!B6=6530353532,'Input Calculation'!A6,\"\")","v":""},null,{"$f":"IFERROR(VLOOKUP(VALUE($B$8),'Input Calculation'!$A$2:$AJ$29,17),\"\")","v":""},{"$f":"_xlfn.IFNA(VLOOKUP($C12,'Product Information'!$A$2:$C$31,2),\"\")","v":""},{"$f":"_xlfn.IFNA(VLOOKUP($C12,'Product Information'!$A$2:$C$31,3),\"\")","v":""}]
[{"$f":"IF('Input Calculation'!B7=6530353532,'Input Calculation'!A7,\"\")","v":1006},null,{"$f":"IFERROR(VLOOKUP(VALUE($B$8),'Input Calculation'!$A$2:$AJ$29,19),\"\")","v":""},{"$f":"_xlfn.IFNA(VLOOKUP($C13,'Product Information'!$A$2:$C$31,2),\"\")","v":""},{"$f":"_xlfn.IFNA(VLOOKUP($C13,'Product Information'!$A$2:$C$31,3),\"\")","v":""}]
[{"$f":"IF('Input Calculation'!B8=6530353532,'Input Calculation'!A8,\"\")","v":""},null,{"$f":"IFERROR(VLOOKUP(VALUE($B$8),'Input Calculation'!$A$2:$AJ$29,21),\"\")","v":""},{"$f":"_xlfn.IFNA(VLOOKUP($C14,'Product Information'!$A$2:$C$31,2),\"\")","v":""},{"$f":"_xlfn.IFNA(VLOOKUP($C14,'Product Information'!$A$2:$C$31,3),\"\")","v":""}]
[{"$f":"IF('Input Calculation'!B9=6530353532,'Input Calculation'!A9,\"\")","v":""},null,{"$f":"IFERROR(VLOOKUP(VALUE($B$8),'Input Calculation'!$A$2:$AJ$29,23),\"\")","v":""},{"$f":"_xlfn.IFNA(VLOOKUP($C15,'Product Information'!$A$2:$C$31,2),\"\")","v":""},{"$f":"_xlfn.IFNA(VLOOKUP($C15,'Product Information'!$A$2:$C$31,3),\"\")","v":""}]
[{"$f":"IF('Input Calculation'!B10=6530353532,'Input Calculation'!A10,\"\")","v":""},null,{"$f":"IFERROR(VLOOKUP(VALUE($B$8),'Input Calculation'!$A$2:$AJ$29,25),\"\")","v":""},{"$f":"_xlfn.IFNA(VLOOKUP($C16,'Product Information'!$A$2:$C$31,2),\"\")","v":""},{"$f":"_xlfn.IFNA(VLOOKUP($C16,'Product Information'!$A$2:$C$31,3),\"\")","v":""}]
[{"$f":"IF('Input Calculation'!B11=6530353532,'Input Calculation'!A11,\"\")","v":1010},null,{"$f":"IFERROR(VLOOKUP(VALUE($B$8),'Input Calculation'!$A$2:$AJ$29,27),\"\")","v":""},{"$f":"_xlfn.IFNA(VLOOKUP($C17,'Product Information'!$A$2:$C$31,2),\"\")","v":""},{"$f":"_xlfn.IFNA(VLOOKUP($C17,'Product Information'!$A$2:$C$31,3),\"\")","v":""}]
[{"$f":"IF('Input Calculation'!B12=6530353532,'Input Calculation'!A12,\"\")","v":""},null,null,"Total:",{"$f":"VLOOKUP(VALUE($B$8),'Input Calculation'!$A$2:$AJ$29,36)","v":203.59999999999997},"Notes: "]
[{"$f":"IF('Input Calculation'!B13=6530353532,'Input Calculation'!A13,\"\")","v":""}]
[{"$f":"IF('Input Calculation'!B14=6530353532,'Input Calculation'!A14,\"\")","v":""},{"$f":"MID($A$7,LEN(B8)+1,4)","v":"1010"},{"$f":"IFERROR(VLOOKUP(VALUE($B$20),'Input Calculation'!$A$2:$AJ$29,9),\"\")","v":3055845},{"$f":"_xlfn.IFNA(VLOOKUP($C20,'Product Information'!$A$2:$C$31,2),\"\")","v":"Winter Jacket"},{"$f":"_xlfn.IFNA(VLOOKUP($C20,'Product Information'!$A$2:$C$31,3),\"\")","v":199.99}]
[{"$f":"IF('Input Calculation'!B15=6530353532,'Input Calculation'!A15,\"\")","v":""},null,{"$f":"IFERROR(VLOOKUP(VALUE($B$20),'Input Calculation'!$A$2:$AJ$29,11),\"\")","v":2056772},{"$f":"_xlfn.IFNA(VLOOKUP($C21,'Product Information'!$A$2:$C$31,2),\"\")","v":"Great Pants"},{"$f":"_xlfn.IFNA(VLOOKUP($C21,'Product Information'!$A$2:$C$31,3),\"\")","v":74.989999999999995}]
[{"$f":"IF('Input Calculation'!B16=6530353532,'Input Calculation'!A16,\"\")","v":""},null,{"$f":"IFERROR(VLOOKUP(VALUE($B$20),'Input Calculation'!$A$2:$AJ$29,13),\"\")","v":5216388},{"$f":"_xlfn.IFNA(VLOOKUP($C22,'Product Information'!$A$2:$C$31,2),\"\")","v":"Logo Hat"},{"$f":"_xlfn.IFNA(VLOOKUP($C22,'Product Information'!$A$2:$C$31,3),\"\")","v":49.99}]
[{"$f":"IF('Input Calculation'!B17=6530353532,'Input Calculation'!A17,\"\")","v":""},null,{"$f":"IFERROR(VLOOKUP(VALUE($B$20),'Input Calculation'!$A$2:$AJ$29,15),\"\")","v":""},{"$f":"_xlfn.IFNA(VLOOKUP($C23,'Product Information'!$A$2:$C$31,2),\"\")","v":""},{"$f":"_xlfn.IFNA(VLOOKUP($C23,'Product Information'!$A$2:$C$31,3),\"\")","v":""}]
[{"$f":"IF('Input Calculation'!B18=6530353532,'Input Calculation'!A18,\"\")","v":""},null,{"$f":"IFERROR(VLOOKUP(VALUE($B$20),'Input Calculation'!$A$2:$AJ$29,17),\"\")","v":""},{"$f":"_xlfn.IFNA(VLOOKUP($C24,'Product Information'!$A$2:$C$31,2),\"\")","v":""},{"$f":"_xlfn.IFNA(VLOOKUP($C24,'Product Information'!$A$2:$C$31,3),\"\")","v":""}]
[{"$f":"IF('Input Calculation'!B19=6530353532,'Input Calculation'!A19,\"\")","v":""},null,{"$f":"IFERROR(VLOOKUP(VALUE($B$20),'Input Calculation'!$A$2:$AJ$29,19),\"\")","v":""},{"$f":"_xlfn.IFNA(VLOOKUP($C25,'Product Information'!$A$2:$C$31,2),\"\")","v":""},{"$f":"_xlfn.IFNA(VLOOKUP($C25,'Product Information'!$A$2:$C$31,3),\"\")","v":""}]
[{"$f":"IF('Input Calculation'!B20=6530353532,'Input Calculation'!A20,\"\")","v":""},null,{"$f":"IFERROR(VLOOKUP(VALUE($B$20),'Input Calculation'!$A$2:$AJ$29,21),\"\")","v":""},{"$f":"_xlfn.IFNA(VLOOKUP($C26,'Product Information'!$A$2:$C$31,2),\"\")","v":""},{"$f":"_xlfn.IFNA(VLOOKUP($C26,'Product Information'!$A$2:$C$31,3),\"\")","v":""}]
[{"$f":"IF('Input Calculation'!B21=6530353532,'Input Calculation'!A21,\"\")","v":""},null,{"$f":"IFERROR(VLOOKUP(VALUE($B$20),'Input Calculation'!$A$2:$AJ$29,23),\"\")","v":""},{"$f":"_xlfn.IFNA(VLOOKUP($C27,'Product Information'!$A$2:$C$31,2),\"\")","v":""},{"$f":"_xlfn.IFNA(VLOOKUP($C27,'Product Information'!$A$2:$C$31,3),\"\")","v":""}]
[{"$f":"IF('Input Calculation'!B22=6530353532,'Input Calculation'!A22,\"\")","v":""},null,{"$f":"IFERROR(VLOOKUP(VALUE($B$20),'Input Calculation'!$A$2:$AJ$29,25),\"\")","v":""},{"$f":"_xlfn.IFNA(VLOOKUP($C28,'Product Information'!$A$2:$C$31,2),\"\")","v":""},{"$f":"_xlfn.IFNA(VLOOKUP($C28,'Product Information'!$A$2:$C$31,3),\"\")","v":""}]
[{"$f":"IF('Input Calculation'!B23=6530353532,'Input Calculation'!A23,\"\")","v":1022},null,{"$f":"IFERROR(VLOOKUP(VALUE($B$20),'Input Calculation'!$A$2:$AJ$29,27),\"\")","v":""},{"$f":"_xlfn.IFNA(VLOOKUP($C29,'Product Information'!$A$2:$C$31,2),\"\")","v":""},{"$f":"_xlfn.IFNA(VLOOKUP($C29,'Product Information'!$A$2:$C$31,3),\"\")","v":""}]
[{"$f":"IF('Input Calculation'!B24=6530353532,'Input Calculation'!A24,\"\")","v":""},null,null,"Total:",{"$f":"IFERROR(VLOOKUP(VALUE($B$20),'Input Calculation'!$A$2:$AJ$29,36),\"\")","v":310.67},"Notes: "]
[{"$f":"IF('Input Calculation'!B25=6530353532,'Input Calculation'!A25,\"\")","v":""}]
[{"$f":"IF('Input Calculation'!B26=6530353532,'Input Calculation'!A26,\"\")","v":""},{"$f":"MID($A$7,LEN(B8)+LEN(B20)+1,4)","v":"1022"},{"$f":"IFERROR(VLOOKUP(VALUE($B$32),'Input Calculation'!$A$2:$AJ$29,9),\"\")","v":8924251},{"$f":"_xlfn.IFNA(VLOOKUP($C32,'Product Information'!$A$2:$C$31,2),\"\")","v":"Super Sunglasses"},{"$f":"_xlfn.IFNA(VLOOKUP($C32,'Product Information'!$A$2:$C$31,3),\"\")","v":99.99}]
[{"$f":"IF('Input Calculation'!B27=6530353532,'Input Calculation'!A27,\"\")","v":""},null,{"$f":"IFERROR(VLOOKUP(VALUE($B$32),'Input Calculation'!$A$2:$AJ$29,11),\"\")","v":""},{"$f":"_xlfn.IFNA(VLOOKUP($C33,'Product Information'!$A$2:$C$31,2),\"\")","v":""},{"$f":"_xlfn.IFNA(VLOOKUP($C33,'Product Information'!$A$2:$C$31,3),\"\")","v":""}]
[{"$f":"IF('Input Calculation'!B28=6530353532,'Input Calculation'!A28,\"\")","v":""},null,{"$f":"IFERROR(VLOOKUP(VALUE($B$32),'Input Calculation'!$A$2:$AJ$29,13),\"\")","v":""},{"$f":"_xlfn.IFNA(VLOOKUP($C34,'Product Information'!$A$2:$C$31,2),\"\")","v":""},{"$f":"_xlfn.IFNA(VLOOKUP($C34,'Product Information'!$A$2:$C$31,3),\"\")","v":""}]
[{"$f":"IF('Input Calculation'!B29=6530353532,'Input Calculation'!A29,\"\")","v":""},null,{"$f":"IFERROR(VLOOKUP(VALUE($B$32),'Input Calculation'!$A$2:$AJ$29,15),\"\")","v":""},{"$f":"_xlfn.IFNA(VLOOKUP($C35,'Product Information'!$A$2:$C$31,2),\"\")","v":""},{"$f":"_xlfn.IFNA(VLOOKUP($C35,'Product Information'!$A$2:$C$31,3),\"\")","v":""}]
[{"$f":"IF('Input Calculation'!B30=6530353532,'Input Calculation'!A30,\"\")","v":""},null,{"$f":"IFERROR(VLOOKUP(VALUE($B$32),'Input Calculation'!$A$2:$AJ$29,17),\"\")","v":""},{"$f":"_xlfn.IFNA(VLOOKUP($C36,'Product Information'!$A$2:$C$31,2),\"\")","v":""},{"$f":"_xlfn.IFNA(VLOOKUP($C36,'Product Information'!$A$2:$C$31,3),\"\")","v":""}]
[null,null,{"$f":"IFERROR(VLOOKUP(VALUE($B$32),'Input Calculation'!$A$2:$AJ$29,19),\"\")","v":""},{"$f":"_xlfn.IFNA(VLOOKUP($C37,'Product Information'!$A$2:$C$31,2),\"\")","v":""},{"$f":"_xlfn.IFNA(VLOOKUP($C37,'Product Information'!$A$2:$C$31,3),\"\")","v":""}]
[null,null,{"$f":"IFERROR(VLOOKUP(VALUE($B$32),'Input Calculation'!$A$2:$AJ$29,21),\"\")","v":""},{"$f":"_xlfn.IFNA(VLOOKUP($C38,'Product Information'!$A$2:$C$31,2),\"\")","v":""},{"$f":"_xlfn.IFNA(VLOOKUP($C38,'Product Information'!$A$2:$C$31,3),\"\")","v":""}]
[null,null,{"$f":"IFERROR(VLOOKUP(VALUE($B$32),'Input Calculation'!$A$2:$AJ$29,23),\"\")","v":""},{"$f":"_xlfn.IFNA(VLOOKUP($C39,'Product Information'!$A$2:$C$31,2),\"\")","v":""},{"$f":"_xlfn.IFNA(VLOOKUP($C39,'Product Information'!$A$2:$C$31,3),\"\")","v":""}]
[null,null,{"$f":"IFERROR(VLOOKUP(VALUE($B$32),'Input Calculation'!$A$2:$AJ$29,25),\"\")","v":""},{"$f":"_xlfn.IFNA(VLOOKUP($C40,'Product Information'!$A$2:$C$31,2),\"\")","v":""},{"$f":"_xlfn.IFNA(VLOOKUP($C40,'Product Information'!$A$2:$C$31,3),\"\")","v":""}]
[null,null,{"$f":"IFERROR(VLOOKUP(VALUE($B$32),'Input Calculation'!$A$2:$AJ$29,27),\"\")","v":""},{"$f":"_xlfn.IFNA(VLOOKUP($C41,'Product Information'!$A$2:$C$31,2),\"\")","v":""},{"$f":"_xlfn.IFNA(VLOOKUP($C41,'Product Information'!$A$2:$C$31,3),\"\")","v":""}]
[null,null,null,"Total:",{"$f":"IFERROR(VLOOKUP(VALUE($B$32),'Input Calculation'!$A$2:$AJ$29,36),\"\")","v":95.59},"Notes: "]
[]
[null,{"$f":"MID($A$7,LEN(B8)+LEN(B20)+LEN(B32)+1,4)","v":""},{"$f":"IFERROR(VLOOKUP(VALUE($B$44),'Input Calculation'!$A$2:$AJ$29,9),\"\")","v":""},{"$f":"_xlfn.IFNA(VLOOKUP($C44,'Product Information'!$A$2:$C$31,2),\"\")","v":""},{"$f":"_xlfn.IFNA(VLOOKUP($C44,'Product Information'!$A$2:$C$31,3),\"\")","v":""}]
[null,null,{"$f":"IFERROR(VLOOKUP(VALUE($B$44),'Input Calculation'!$A$2:$AJ$29,11),\"\")","v":""},{"$f":"_xlfn.IFNA(VLOOKUP($C45,'Product Information'!$A$2:$C$31,2),\"\")","v":""},{"$f":"_xlfn.IFNA(VLOOKUP($C45,'Product Information'!$A$2:$C$31,3),\"\")","v":""}]
[null,null,{"$f":"IFERROR(VLOOKUP(VALUE($B$44),'Input Calculation'!$A$2:$AJ$29,13),\"\")","v":""},{"$f":"_xlfn.IFNA(VLOOKUP($C46,'Product Information'!$A$2:$C$31,2),\"\")","v":""},{"$f":"_xlfn.IFNA(VLOOKUP($C46,'Product Information'!$A$2:$C$31,3),\"\")","v":""}]
[null,null,{"$f":"IFERROR(VLOOKUP(VALUE($B$44),'Input Calculation'!$A$2:$AJ$29,15),\"\")","v":""},{"$f":"_xlfn.IFNA(VLOOKUP($C47,'Product Information'!$A$2:$C$31,2),\"\")","v":""},{"$f":"_xlfn.IFNA(VLOOKUP($C47,'Product Information'!$A$2:$C$31,3),\"\")","v":""}]
[null,null,{"$f":"IFERROR(VLOOKUP(VALUE($B$44),'Input Calculation'!$A$2:$AJ$29,17),\"\")","v":""},{"$f":"_xlfn.IFNA(VLOOKUP($C48,'Product Information'!$A$2:$C$31,2),\"\")","v":""},{"$f":"_xlfn.IFNA(VLOOKUP($C48,'Product Information'!$A$2:$C$31,3),\"\")","v":""}]
[null,null,{"$f":"IFERROR(VLOOKUP(VALUE($B$44),'Input Calculation'!$A$2:$AJ$29,19),\"\")","v":""},{"$f":"_xlfn.IFNA(VLOOKUP($C49,'Product Information'!$A$2:$C$31,2),\"\")","v":""},{"$f":"_xlfn.IFNA(VLOOKUP($C49,'Product Information'!$A$2:$C$31,3),\"\")","v":""}]
[null,null,{"$f":"IFERROR(VLOOKUP(VALUE($B$44),'Input Calculation'!$A$2:$AJ$29,21),\"\")","v":""},{"$f":"_xlfn.IFNA(VLOOKUP($C50,'Product Information'!$A$2:$C$31,2),\"\")","v":""},{"$f":"_xlfn.IFNA(VLOOKUP($C50,'Product Information'!$A$2:$C$31,3),\"\")","v":""}]
[null,null,{"$f":"IFERROR(VLOOKUP(VALUE($B$44),'Input Calculation'!$A$2:$AJ$29,23),\"\")","v":""},{"$f":"_xlfn.IFNA(VLOOKUP($C51,'Product Information'!$A$2:$C$31,2),\"\")","v":""},{"$f":"_xlfn.IFNA(VLOOKUP($C51,'Product Information'!$A$2:$C$31,3),\"\")","v":""}]
[null,null,{"$f":"IFERROR(VLOOKUP(VALUE($B$44),'Input Calculation'!$A$2:$AJ$29,25),\"\")","v":""},{"$f":"_xlfn.IFNA(VLOOKUP($C52,'Product Information'!$A$2:$C$31,2),\"\")","v":""},{"$f":"_xlfn.IFNA(VLOOKUP($C52,'Product Information'!$A$2:$C$31,3),\"\")","v":""}]
[null,null,{"$f":"IFERROR(VLOOKUP(VALUE($B$44),'Input Calculation'!$A$2:$AJ$29,27),\"\")","v":""},{"$f":"_xlfn.IFNA(VLOOKUP($C53,'Product Information'!$A$2:$C$31,2),\"\")","v":""},{"$f":"_xlfn.IFNA(VLOOKUP($C53,'Product Information'!$A$2:$C$31,3),\"\")","v":""}]
[null,null,null,"Total:",{"$f":"IFERROR(VLOOKUP(VALUE($B$44),'Input Calculation'!$A$2:$AJ$29,36),\"\")","v":""},"Notes: "]
[]
[null,{"$f":"MID($A$7,LEN(B8)+LEN(B20)+LEN(B32)+LEN(B44)+1,4)","v":""},{"$f":"IFERROR(VLOOKUP(VALUE($B$56),'Input Calculation'!$A$2:$AJ$29,9),\"\")","v":""},{"$f":"_xlfn.IFNA(VLOOKUP($C56,'Product Information'!$A$2:$C$31,2),\"\")","v":""},{"$f":"_xlfn.IFNA(VLOOKUP($C56,'Product Information'!$A$2:$C$31,3),\"\")","v":""}]
[null,null,{"$f":"IFERROR(VLOOKUP(VALUE($B$56),'Input Calculation'!$A$2:$AJ$29,11),\"\")","v":""},{"$f":"_xlfn.IFNA(VLOOKUP($C57,'Product Information'!$A$2:$C$31,2),\"\")","v":""},{"$f":"_xlfn.IFNA(VLOOKUP($C57,'Product Information'!$A$2:$C$31,3),\"\")","v":""}]
[null,null,{"$f":"IFERROR(VLOOKUP(VALUE($B$56),'Input Calculation'!$A$2:$AJ$29,13),\"\")","v":""},{"$f":"_xlfn.IFNA(VLOOKUP($C58,'Product Information'!$A$2:$C$31,2),\"\")","v":""},{"$f":"_xlfn.IFNA(VLOOKUP($C58,'Product Information'!$A$2:$C$31,3),\"\")","v":""}]
[null,null,{"$f":"IFERROR(VLOOKUP(VALUE($B$56),'Input Calculation'!$A$2:$AJ$29,15),\"\")","v":""},{"$f":"_xlfn.IFNA(VLOOKUP($C59,'Product Information'!$A$2:$C$31,2),\"\")","v":""},{"$f":"_xlfn.IFNA(VLOOKUP($C59,'Product Information'!$A$2:$C$31,3),\"\")","v":""}]
[null,null,{"$f":"IFERROR(VLOOKUP(VALUE($B$56),'Input Calculation'!$A$2:$AJ$29,17),\"\")","v":""},{"$f":"_xlfn.IFNA(VLOOKUP($C60,'Product Information'!$A$2:$C$31,2),\"\")","v":""},{"$f":"_xlfn.IFNA(VLOOKUP($C60,'Product Information'!$A$2:$C$31,3),\"\")","v":""}]
[null,null,{"$f":"IFERROR(VLOOKUP(VALUE($B$56),'Input Calculation'!$A$2:$AJ$29,19),\"\")","v":""},{"$f":"_xlfn.IFNA(VLOOKUP($C61,'Product Information'!$A$2:$C$31,2),\"\")","v":""},{"$f":"_xlfn.IFNA(VLOOKUP($C61,'Product Information'!$A$2:$C$31,3),\"\")","v":""}]
[null,null,{"$f":"IFERROR(VLOOKUP(VALUE($B$56),'Input Calculation'!$A$2:$AJ$29,21),\"\")","v":""},{"$f":"_xlfn.IFNA(VLOOKUP($C62,'Product Information'!$A$2:$C$31,2),\"\")","v":""},{"$f":"_xlfn.IFNA(VLOOKUP($C62,'Product Information'!$A$2:$C$31,3),\"\")","v":""}]
[null,null,{"$f":"IFERROR(VLOOKUP(VALUE($B$56),'Input Calculation'!$A$2:$AJ$29,23),\"\")","v":""},{"$f":"_xlfn.IFNA(VLOOKUP($C63,'Product Information'!$A$2:$C$31,2),\"\")","v":""},{"$f":"_xlfn.IFNA(VLOOKUP($C63,'Product Information'!$A$2:$C$31,3),\"\")","v":""}]
[null,null,{"$f":"IFERROR(VLOOKUP(VALUE($B$56),'Input Calculation'!$A$2:$AJ$29,25),\"\")","v":""},{"$f":"_xlfn.IFNA(VLOOKUP($C64,'Product Information'!$A$2:$C$31,2),\"\")","v":""},{"$f":"_xlfn.IFNA(VLOOKUP($C64,'Product Information'!$A$2:$C$31,3),\"\")","v":""}]
[null,null,{"$f":"IFERROR(VLOOKUP(VALUE($B$56),'Input Calculation'!$A$2:$AJ$29,27),\"\")","v":""},{"$f":"_xlfn.IFNA(VLOOKUP($C65,'Product Information'!$A$2:$C$31,2),\"\")","v":""},{"$f":"_xlfn.IFNA(VLOOKUP($C65,'Product Information'!$A$2:$C$31,3),\"\")","v":""}]
[null,null,null,"Total:",{"$f":"IFERROR(VLOOKUP(VALUE($B$56),'Input Calculation'!$A$2:$AJ$29,36),\"\")","v":""},"Notes: "]
[]
[null,{"$f":"MID($A$7,LEN(B8)+LEN(B20)+LEN(B32)+LEN(B44)+LEN(B56)+1,4)","v":""},{"$f":"IFERROR(VLOOKUP(VALUE($B$68),'Input Calculation'!$A$2:$AJ$29,9),\"\")","v":""},{"$f":"_xlfn.IFNA(VLOOKUP($C68,'Product Information'!$A$2:$C$31,2),\"\")","v":""},{"$f":"_xlfn.IFNA(VLOOKUP($C68,'Product Information'!$A$2:$C$31,3),\"\")","v":""}]
[null,null,{"$f":"IFERROR(VLOOKUP(VALUE($B$68),'Input Calculation'!$A$2:$AJ$29,11),\"\")","v":""},{"$f":"_xlfn.IFNA(VLOOKUP($C69,'Product Information'!$A$2:$C$31,2),\"\")","v":""},{"$f":"_xlfn.IFNA(VLOOKUP($C69,'Product Information'!$A$2:$C$31,3),\"\")","v":""}]
[null,null,{"$f":"IFERROR(VLOOKUP(VALUE($B$68),'Input Calculation'!$A$2:$AJ$29,13),\"\")","v":""},{"$f":"_xlfn.IFNA(VLOOKUP($C70,'Product Information'!$A$2:$C$31,2),\"\")","v":""},{"$f":"_xlfn.IFNA(VLOOKUP($C70,'Product Information'!$A$2:$C$31,3),\"\")","v":""}]
[null,null,{"$f":"IFERROR(VLOOKUP(VALUE($B$68),'Input Calculation'!$A$2:$AJ$29,15),\"\")","v":""},{"$f":"_xlfn.IFNA(VLOOKUP($C71,'Product Information'!$A$2:$C$31,2),\"\")","v":""},{"$f":"_xlfn.IFNA(VLOOKUP($C71,'Product Information'!$A$2:$C$31,3),\"\")","v":""}]
[null,null,{"$f":"IFERROR(VLOOKUP(VALUE($B$68),'Input Calculation'!$A$2:$AJ$29,17),\"\")","v":""},{"$f":"_xlfn.IFNA(VLOOKUP($C72,'Product Information'!$A$2:$C$31,2),\"\")","v":""},{"$f":"_xlfn.IFNA(VLOOKUP($C72,'Product Information'!$A$2:$C$31,3),\"\")","v":""}]
[null,null,{"$f":"IFERROR(VLOOKUP(VALUE($B$68),'Input Calculation'!$A$2:$AJ$29,19),\"\")","v":""},{"$f":"_xlfn.IFNA(VLOOKUP($C73,'Product Information'!$A$2:$C$31,2),\"\")","v":""},{"$f":"_xlfn.IFNA(VLOOKUP($C73,'Product Information'!$A$2:$C$31,3),\"\")","v":""}]
[null,null,{"$f":"IFERROR(VLOOKUP(VALUE($B$68),'Input Calculation'!$A$2:$AJ$29,21),\"\")","v":""},{"$f":"_xlfn.IFNA(VLOOKUP($C74,'Product Information'!$A$2:$C$31,2),\"\")","v":""},{"$f":"_xlfn.IFNA(VLOOKUP($C74,'Product Information'!$A$2:$C$31,3),\"\")","v":""}]
[null,null,{"$f":"IFERROR(VLOOKUP(VALUE($B$68),'Input Calculation'!$A$2:$AJ$29,23),\"\")","v":""},{"$f":"_xlfn.IFNA(VLOOKUP($C75,'Product Information'!$A$2:$C$31,2),\"\")","v":""},{"$f":"_xlfn.IFNA(VLOOKUP($C75,'Product Information'!$A$2:$C$31,3),\"\")","v":""}]
[null,null,{"$f":"IFERROR(VLOOKUP(VALUE($B$68),'Input Calculation'!$A$2:$AJ$29,25),\"\")","v":""},{"$f":"_xlfn.IFNA(VLOOKUP($C76,'Product Information'!$A$2:$C$31,2),\"\")","v":""},{"$f":"_xlfn.IFNA(VLOOKUP($C76,'Product Information'!$A$2:$C$31,3),\"\")","v":""}]
[null,null,{"$f":"IFERROR(VLOOKUP(VALUE($B$68),'Input Calculation'!$A$2:$AJ$29,27),\"\")","v":""},{"$f":"_xlfn.IFNA(VLOOKUP($C77,'Product Information'!$A$2:$C$31,2),\"\")","v":""},{"$f":"_xlfn.IFNA(VLOOKUP($C77,'Product Information'!$A$2:$C$31,3),\"\")","v":""}]
[null,null,null,"Total:",{"$f":"IFERROR(VLOOKUP(VALUE($B$68),'Input Calculation'!$A$2:$AJ$29,36),\"\")","v":""},"Notes: "]

{"sheet":"7139892245","index":13,"n_rows":78,"n_cols":6,"rows_kept":78,"cut":false,"hidden":true,"merged":[]}
["Name:",{"$f":"VLOOKUP(7139892245,'Customer Information'!$A$2:$I$12,2)","v":"Kaploozie Suzie"}]
["Phone:",{"$f":"TEXT(7139892245,\"###-###-####\")","v":"713-989-2245"}]
["Email:",{"$f":"VLOOKUP(7139892245,'Customer Information'!$A$2:$I$12,3)","v":"sk2002@hotmail.com"}]
["Address:",{"$f":"CONCATENATE(VLOOKUP(7139892245,'Customer Information'!$A$2:$I$12,4),\", \",VLOOKUP(7139892245,'Customer Information'!$A$2:$I$12,5),\", \",VLOOKUP(7139892245,'Customer Information'!$A$2:$I$12,6),\" \",VLOOKUP(7139892245,'Customer Information'!$A$2:$I$12,7))","v":"3 Pine Road, Albany, NY 12313"}]
["Customer Since:",{"$f":"VLOOKUP(7139892245,'Customer Information'!$A$2:$I$12,8)","v":2003}]
["Good Standing:",{"$f":"VLOOKUP(7139892245,'Customer Information'!$A$2:$I$12,9)","v":"Yes"}]
[{"$f":"CONCATENATE(A8,A9,A10,A11,A12,A13,A14,A15,A16,A17,A18,A19,A20,A21,A22,A23,A24,A25,A26,A27,A28,A29,A30,A31,A32,A33,A34,A35,A36)","v":"1003100910121025"},"Order Number"]
[{"$f":"IF('Input Calculation'!B2=7139892245,'Input Calculation'!A2,\"\")","v":""},{"$f":"MID($A$7,ROW()-7,4)","v":"1003"},{"$f":"IFERROR(VLOOKUP(VALUE($B$8),'Input Calculation'!$A$2:$AJ$29,9),\"\")","v":3055845},{"$f":"_xlfn.IFNA(VLOOKUP($C8,'Product Information'!$A$2:$C$31,2),\"\")","v":"Winter Jacket"},{"$f":"_xlfn.IFNA(VLOOKUP($C8,'Product Information'!$A$2:$C$31,3),\"\")","v":199.99}]
[{"$f":"IF('Input Calculation'!B3=7139892245,'Input Calculation'!A3,\"\")","v":""},null,{"$f":"IFERROR(VLOOKUP(VALUE($B$8),'Input Calculation'!$A$2:$AJ$29,11),\"\")","v":""},{"$f":"_xlfn.IFNA(VLOOKUP($C9,'Product Information'!$A$2:$C$31,2),\"\")","v":""},{"$f":"_xlfn.IFNA(VLOOKUP($C9,'Product Information'!$A$2:$C$31,3),\"\")","v":""}]
[{"$f":"IF('Input Calculation'!B4=7139892245,'Input Calculation'!A4,\"\")","v":1003},null,{"$f":"IFERROR(VLOOKUP(VALUE($B$8),'Input Calculation'!$A$2:$AJ$29,13),\"\")","v":""},{"$f":"_xlfn.IFNA(VLOOKUP($C10,'Product Information'!$A$2:$C$31,2),\"\")","v":""},{"$f":"_xlfn.IFNA(VLOOKUP($C10,'Product Information'!$A$2:$C$31,3),\"\")","v":""}]
[{"$f":"IF('Input Calculation'!B5=7139892245,'Input Calculation'!A5,\"\")","v":""},null,{"$f":"IFERROR(VLOOKUP(VALUE($B$8),'Input Calculation'!$A$2:$AJ$29,15),\"\")","v":""},{"$f":"_xlfn.IFNA(VLOOKUP($C11,'Product Information'!$A$2:$C$31,2),\"\")","v":""},{"$f":"_xlfn.IFNA(VLOOKUP($C11,'Product Information'!$A$2:$C$31,3),\"\")","v":""}]
[{"$f":"IF('Input Calculation'!B6=7139892245,'Input Calculation'!A6,\"\")","v":""},null,{"$f":"IFERROR(VLOOKUP(VALUE($B$8),'Input Calculation'!$A$2:$AJ$29,17),\"\")","v":""},{"$f":"_xlfn.IFNA(VLOOKUP($C12,'Product Information'!$A$2:$C$31,2),\"\")","v":""},{"$f":"_xlfn.IFNA(VLOOKUP($C12,'Product Information'!$A$2:$C$31,3),\"\")","v":""}]
[{"$f":"IF('Input Calculation'!B7=7139892245,'Input Calculation'!A7,\"\")","v":""},null,{"$f":"IFERROR(VLOOKUP(VALUE($B$8),'Input Calculation'!$A$2:$AJ$29,19),\"\")","v":""},{"$f":"_xlfn.IFNA(VLOOKUP($C13,'Product Information'!$A$2:$C$31,2),\"\")","v":""},{"$f":"_xlfn.IFNA(VLOOKUP($C13,'Product Information'!$A$2:$C$31,3),\"\")","v":""}]
[{"$f":"IF('Input Calculation'!B8=7139892245,'Input Calculation'!A8,\"\")","v":""},null,{"$f":"IFERROR(VLOOKUP(VALUE($B$8),'Input Calculation'!$A$2:$AJ$29,21),\"\")","v":""},{"$f":"_xlfn.IFNA(VLOOKUP($C14,'Product Information'!$A$2:$C$31,2),\"\")","v":""},{"$f":"_xlfn.IFNA(VLOOKUP($C14,'Product Information'!$A$2:$C$31,3),\"\")","v":""}]
[{"$f":"IF('Input Calculation'!B9=7139892245,'Input Calculation'!A9,\"\")","v":""},null,{"$f":"IFERROR(VLOOKUP(VALUE($B$8),'Input Calculation'!$A$2:$AJ$29,23),\"\")","v":""},{"$f":"_xlfn.IFNA(VLOOKUP($C15,'Product Information'!$A$2:$C$31,2),\"\")","v":""},{"$f":"_xlfn.IFNA(VLOOKUP($C15,'Product Information'!$A$2:$C$31,3),\"\")","v":""}]
[{"$f":"IF('Input Calculation'!B10=7139892245,'Input Calculation'!A10,\"\")","v":1009},null,{"$f":"IFERROR(VLOOKUP(VALUE($B$8),'Input Calculation'!$A$2:$AJ$29,25),\"\")","v":""},{"$f":"_xlfn.IFNA(VLOOKUP($C16,'Product Information'!$A$2:$C$31,2),\"\")","v":""},{"$f":"_xlfn.IFNA(VLOOKUP($C16,'Product Information'!$A$2:$C$31,3),\"\")","v":""}]
[{"$f":"IF('Input Calculation'!B11=7139892245,'Input Calculation'!A11,\"\")","v":""},null,{"$f":"IFERROR(VLOOKUP(VALUE($B$8),'Input Calculation'!$A$2:$AJ$29,27),\"\")","v":""},{"$f":"_xlfn.IFNA(VLOOKUP($C17,'Product Information'!$A$2:$C$31,2),\"\")","v":""},{"$f":"_xlfn.IFNA(VLOOKUP($C17,'Product Information'!$A$2:$C$31,3),\"\")","v":""}]
[{"$f":"IF('Input Calculation'!B12=7139892245,'Input Calculation'!A12,\"\")","v":""},null,null,"Total:",{"$f":"VLOOKUP(VALUE($B$8),'Input Calculation'!$A$2:$AJ$29,36)","v":173.64},"Notes: "]
[{"$f":"IF('Input Calculation'!B13=7139892245,'Input Calculation'!A13,\"\")","v":1012}]
[{"$f":"IF('Input Calculation'!B14=7139892245,'Input Calculation'!A14,\"\")","v":""},{"$f":"MID($A$7,LEN(B8)+1,4)","v":"1009"},{"$f":"IFERROR(VLOOKUP(VALUE($B$20),'Input Calculation'!$A$2:$AJ$29,9),\"\")","v":2056772},{"$f":"_xlfn.IFNA(VLOOKUP($C20,'Product Information'!$A$2:$C$31,2),\"\")","v":"Great Pants"},{"$f":"_xlfn.IFNA(VLOOKUP($C20,'Product Information'!$A$2:$C$31,3),\"\")","v":74.989999999999995}]
[{"$f":"IF('Input Calculation'!B15=7139892245,'Input Calculation'!A15,\"\")","v":""},null,{"$f":"IFERROR(VLOOKUP(VALUE($B$20),'Input Calculation'!$A$2:$AJ$29,11),\"\")","v":""},{"$f":"_xlfn.IFNA(VLOOKUP($C21,'Product Information'!$A$2:$C$31,2),\"\")","v":""},{"$f":"_xlfn.IFNA(VLOOKUP($C21,'Product Information'!$A$2:$C$31,3),\"\")","v":""}]
[{"$f":"IF('Input Calculation'!B16=7139892245,'Input Calculation'!A16,\"\")","v":""},null,{"$f":"IFERROR(VLOOKUP(VALUE($B$20),'Input Calculation'!$A$2:$AJ$29,13),\"\")","v":""},{"$f":"_xlfn.IFNA(VLOOKUP($C22,'Product Information'!$A$2:$C$31,2),\"\")","v":""},{"$f":"_xlfn.IFNA(VLOOKUP($C22,'Product Information'!$A$2:$C$31,3),\"\")","v":""}]
[{"$f":"IF('Input Calculation'!B17=7139892245,'Input Calculation'!A17,\"\")","v":""},null,{"$f":"IFERROR(VLOOKUP(VALUE($B$20),'Input Calculation'!$A$2:$AJ$29,15),\"\")","v":""},{"$f":"_xlfn.IFNA(VLOOKUP($C23,'Product Information'!$A$2:$C$31,2),\"\")","v":""},{"$f":"_xlfn.IFNA(VLOOKUP($C23,'Product Information'!$A$2:$C$31,3),\"\")","v":""}]
[{"$f":"IF('Input Calculation'!B18=7139892245,'Input Calculation'!A18,\"\")","v":""},null,{"$f":"IFERROR(VLOOKUP(VALUE($B$20),'Input Calculation'!$A$2:$AJ$29,17),\"\")","v":""},{"$f":"_xlfn.IFNA(VLOOKUP($C24,'Product Information'!$A$2:$C$31,2),\"\")","v":""},{"$f":"_xlfn.IFNA(VLOOKUP($C24,'Product Information'!$A$2:$C$31,3),\"\")","v":""}]
[{"$f":"IF('Input Calculation'!B19=7139892245,'Input Calculation'!A19,\"\")","v":""},null,{"$f":"IFERROR(VLOOKUP(VALUE($B$20),'Input Calculation'!$A$2:$AJ$29,19),\"\")","v":""},{"$f":"_xlfn.IFNA(VLOOKUP($C25,'Product Information'!$A$2:$C$31,2),\"\")","v":""},{"$f":"_xlfn.IFNA(VLOOKUP($C25,'Product Information'!$A$2:$C$31,3),\"\")","v":""}]
[{"$f":"IF('Input Calculation'!B20=7139892245,'Input Calculation'!A20,\"\")","v":""},null,{"$f":"IFERROR(VLOOKUP(VALUE($B$20),'Input Calculation'!$A$2:$AJ$29,21),\"\")","v":""},{"$f":"_xlfn.IFNA(VLOOKUP($C26,'Product Information'!$A$2:$C$31,2),\"\")","v":""},{"$f":"_xlfn.IFNA(VLOOKUP($C26,'Product Information'!$A$2:$C$31,3),\"\")","v":""}]
[{"$f":"IF('Input Calculation'!B21=7139892245,'Input Calculation'!A21,\"\")","v":""},null,{"$f":"IFERROR(VLOOKUP(VALUE($B$20),'Input Calculation'!$A$2:$AJ$29,23),\"\")","v":""},{"$f":"_xlfn.IFNA(VLOOKUP($C27,'Product Information'!$A$2:$C$31,2),\"\")","v":""},{"$f":"_xlfn.IFNA(VLOOKUP($C27,'Product Information'!$A$2:$C$31,3),\"\")","v":""}]
[{"$f":"IF('Input Calculation'!B22=7139892245,'Input Calculation'!A22,\"\")","v":""},null,{"$f":"IFERROR(VLOOKUP(VALUE($B$20),'Input Calculation'!$A$2:$AJ$29,25),\"\")","v":""},{"$f":"_xlfn.IFNA(VLOOKUP($C28,'Product Information'!$A$2:$C$31,2),\"\")","v":""},{"$f":"_xlfn.IFNA(VLOOKUP($C28,'Product Information'!$A$2:$C$31,3),\"\")","v":""}]
[{"$f":"IF('Input Calculation'!B23=7139892245,'Input Calculation'!A23,\"\")","v":""},null,{"$f":"IFERROR(VLOOKUP(VALUE($B$20),'Input Calculation'!$A$2:$AJ$29,27),\"\")","v":""},{"$f":"_xlfn.IFNA(VLOOKUP($C29,'Product Information'!$A$2:$C$31,2),\"\")","v":""},{"$f":"_xlfn.IFNA(VLOOKUP($C29,'Product Information'!$A$2:$C$31,3),\"\")","v":""}]
[{"$f":"IF('Input Calculation'!B24=7139892245,'Input Calculation'!A24,\"\")","v":""},null,null,"Total:",{"$f":"IFERROR(VLOOKUP(VALUE($B$20),'Input Calculation'!$A$2:$AJ$29,36),\"\")","v":65.12},"Notes: "]
[{"$f":"IF('Input Calculation'!B25=7139892245,'Input Calculation'!A25,\"\")","v":""}]
[{"$f":"IF('Input Calculation'!B26=7139892245,'Input Calculation'!A26,\"\")","v":1025},{"$f":"MID($A$7,LEN(B8)+LEN(B20)+1,4)","v":"1012"},{"$f":"IFERROR(VLOOKUP(VALUE($B$32),'Input Calculation'!$A$2:$AJ$29,9),\"\")","v":3055845},{"$f":"_xlfn.IFNA(VLOOKUP($C32,'Product Information'!$A$2:$C$31,2),\"\")","v":"Winter Jacket"},{"$f":"_xlfn.IFNA(VLOOKUP($C32,'Product Information'!$A$2:$C$31,3),\"\")","v":199.99}]
[{"$f":"IF('Input Calculation'!B27=7139892245,'Input Calculation'!A27,\"\")","v":""},null,{"$f":"IFERROR(VLOOKUP(VALUE($B$32),'Input Calculation'!$A$2:$AJ$29,11),\"\")","v":8924251},{"$f":"_xlfn.IFNA(VLOOKUP($C33,'Product Information'!$A$2:$C$31,2),\"\")","v":"Super Sunglasses"},{"$f":"_xlfn.IFNA(VLOOKUP($C33,'Product Information'!$A$2:$C$31,3),\"\")","v":99.99}]
[{"$f":"IF('Input Calculation'!B28=7139892245,'Input Calculation'!A28,\"\")","v":""},null,{"$f":"IFERROR(VLOOKUP(VALUE($B$32),'Input Calculation'!$A$2:$AJ$29,13),\"\")","v":""},{"$f":"_xlfn.IFNA(VLOOKUP($C34,'Product Information'!$A$2:$C$31,2),\"\")","v":""},{"$f":"_xlfn.IFNA(VLOOKUP($C34,'Product Information'!$A$2:$C$31,3),\"\")","v":""}]
[{"$f":"IF('Input Calculation'!B29=7139892245,'Input Calculation'!A29,\"\")","v":""},null,{"$f":"IFERROR(VLOOKUP(VALUE($B$32),'Input Calculation'!$A$2:$AJ$29,15),\"\")","v":""},{"$f":"_xlfn.IFNA(VLOOKUP($C35,'Product Information'!$A$2:$C$31,2),\"\")","v":""},{"$f":"_xlfn.IFNA(VLOOKUP($C35,'Product Information'!$A$2:$C$31,3),\"\")","v":""}]
[{"$f":"IF('Input Calculation'!B30=7139892245,'Input Calculation'!A30,\"\")","v":""},null,{"$f":"IFERROR(VLOOKUP(VALUE($B$32),'Input Calculation'!$A$2:$AJ$29,17),\"\")","v":""},{"$f":"_xlfn.IFNA(VLOOKUP($C36,'Product Information'!$A$2:$C$31,2),\"\")","v":""},{"$f":"_xlfn.IFNA(VLOOKUP($C36,'Product Information'!$A$2:$C$31,3),\"\")","v":""}]
[null,null,{"$f":"IFERROR(VLOOKUP(VALUE($B$32),'Input Calculation'!$A$2:$AJ$29,19),\"\")","v":""},{"$f":"_xlfn.IFNA(VLOOKUP($C37,'Product Information'!$A$2:$C$31,2),\"\")","v":""},{"$f":"_xlfn.IFNA(VLOOKUP($C37,'Product Information'!$A$2:$C$31,3),\"\")","v":""}]
[null,null,{"$f":"IFERROR(VLOOKUP(VALUE($B$32),'Input Calculation'!$A$2:$AJ$29,21),\"\")","v":""},{"$f":"_xlfn.IFNA(VLOOKUP($C38,'Product Information'!$A$2:$C$31,2),\"\")","v":""},{"$f":"_xlfn.IFNA(VLOOKUP($C38,'Product Information'!$A$2:$C$31,3),\"\")","v":""}]
[null,null,{"$f":"IFERROR(VLOOKUP(VALUE($B$32),'Input Calculation'!$A$2:$AJ$29,23),\"\")","v":""},{"$f":"_xlfn.IFNA(VLOOKUP($C39,'Product Information'!$A$2:$C$31,2),\"\")","v":""},{"$f":"_xlfn.IFNA(VLOOKUP($C39,'Product Information'!$A$2:$C$31,3),\"\")","v":""}]
[null,null,{"$f":"IFERROR(VLOOKUP(VALUE($B$32),'Input Calculation'!$A$2:$AJ$29,25),\"\")","v":""},{"$f":"_xlfn.IFNA(VLOOKUP($C40,'Product Information'!$A$2:$C$31,2),\"\")","v":""},{"$f":"_xlfn.IFNA(VLOOKUP($C40,'Product Information'!$A$2:$C$31,3),\"\")","v":""}]
[null,null,{"$f":"IFERROR(VLOOKUP(VALUE($B$32),'Input Calculation'!$A$2:$AJ$29,27),\"\")","v":""},{"$f":"_xlfn.IFNA(VLOOKUP($C41,'Product Information'!$A$2:$C$31,2),\"\")","v":""},{"$f":"_xlfn.IFNA(VLOOKUP($C41,'Product Information'!$A$2:$C$31,3),\"\")","v":""}]
[null,null,null,"Total:",{"$f":"IFERROR(VLOOKUP(VALUE($B$32),'Input Calculation'!$A$2:$AJ$29,36),\"\")","v":260.44},"Notes: "]
[]
[null,{"$f":"MID($A$7,LEN(B8)+LEN(B20)+LEN(B32)+1,4)","v":"1025"},{"$f":"IFERROR(VLOOKUP(VALUE($B$44),'Input Calculation'!$A$2:$AJ$29,9),\"\")","v":9242514},{"$f":"_xlfn.IFNA(VLOOKUP($C44,'Product Information'!$A$2:$C$31,2),\"\")","v":"Fashionista Sunglasses"},{"$f":"_xlfn.IFNA(VLOOKUP($C44,'Product Information'!$A$2:$C$31,3),\"\")","v":499.99}]
[null,null,{"$f":"IFERROR(VLOOKUP(VALUE($B$44),'Input Calculation'!$A$2:$AJ$29,11),\"\")","v":5216388},{"$f":"_xlfn.IFNA(VLOOKUP($C45,'Product Information'!$A$2:$C$31,2),\"\")","v":"Logo Hat"},{"$f":"_xlfn.IFNA(VLOOKUP($C45,'Product Information'!$A$2:$C$31,3),\"\")","v":49.99}]
[null,null,{"$f":"IFERROR(VLOOKUP(VALUE($B$44),'Input Calculation'!$A$2:$AJ$29,13),\"\")","v":""},{"$f":"_xlfn.IFNA(VLOOKUP($C46,'Product Information'!$A$2:$C$31,2),\"\")","v":""},{"$f":"_xlfn.IFNA(VLOOKUP($C46,'Product Information'!$A$2:$C$31,3),\"\")","v":""}]
[null,null,{"$f":"IFERROR(VLOOKUP(VALUE($B$44),'Input Calculation'!$A$2:$AJ$29,15),\"\")","v":""},{"$f":"_xlfn.IFNA(VLOOKUP($C47,'Product Information'!$A$2:$C$31,2),\"\")","v":""},{"$f":"_xlfn.IFNA(VLOOKUP($C47,'Product Information'!$A$2:$C$31,3),\"\")","v":""}]
[null,null,{"$f":"IFERROR(VLOOKUP(VALUE($B$44),'Input Calculation'!$A$2:$AJ$29,17),\"\")","v":""},{"$f":"_xlfn.IFNA(VLOOKUP($C48,'Product Information'!$A$2:$C$31,2),\"\")","v":""},{"$f":"_xlfn.IFNA(VLOOKUP($C48,'Product Information'!$A$2:$C$31,3),\"\")","v":""}]
[null,null,{"$f":"IFERROR(VLOOKUP(VALUE($B$44),'Input Calculation'!$A$2:$AJ$29,19),\"\")","v":""},{"$f":"_xlfn.IFNA(VLOOKUP($C49,'Product Information'!$A$2:$C$31,2),\"\")","v":""},{"$f":"_xlfn.IFNA(VLOOKUP($C49,'Product Information'!$A$2:$C$31,3),\"\")","v":""}]
[null,null,{"$f":"IFERROR(VLOOKUP(VALUE($B$44),'Input Calculation'!$A$2:$AJ$29,21),\"\")","v":""},{"$f":"_xlfn.IFNA(VLOOKUP($C50,'Product Information'!$A$2:$C$31,2),\"\")","v":""},{"$f":"_xlfn.IFNA(VLOOKUP($C50,'Product Information'!$A$2:$C$31,3),\"\")","v":""}]
[null,null,{"$f":"IFERROR(VLOOKUP(VALUE($B$44),'Input Calculation'!$A$2:$AJ$29,23),\"\")","v":""},{"$f":"_xlfn.IFNA(VLOOKUP($C51,'Product Information'!$A$2:$C$31,2),\"\")","v":""},{"$f":"_xlfn.IFNA(VLOOKUP($C51,'Product Information'!$A$2:$C$31,3),\"\")","v":""}]
[null,null,{"$f":"IFERROR(VLOOKUP(VALUE($B$44),'Input Calculation'!$A$2:$AJ$29,25),\"\")","v":""},{"$f":"_xlfn.IFNA(VLOOKUP($C52,'Product Information'!$A$2:$C$31,2),\"\")","v":""},{"$f":"_xlfn.IFNA(VLOOKUP($C52,'Product Information'!$A$2:$C$31,3),\"\")","v":""}]
[null,null,{"$f":"IFERROR(VLOOKUP(VALUE($B$44),'Input Calculation'!$A$2:$AJ$29,27),\"\")","v":""},{"$f":"_xlfn.IFNA(VLOOKUP($C53,'Product Information'!$A$2:$C$31,2),\"\")","v":""},{"$f":"_xlfn.IFNA(VLOOKUP($C53,'Product Information'!$A$2:$C$31,3),\"\")","v":""}]
[null,null,null,"Total:",{"$f":"IFERROR(VLOOKUP(VALUE($B$44),'Input Calculation'!$A$2:$AJ$29,36),\"\")","v":537.16},"Notes: "]
[]
[null,{"$f":"MID($A$7,LEN(B8)+LEN(B20)+LEN(B32)+LEN(B44)+1,4)","v":""},{"$f":"IFERROR(VLOOKUP(VALUE($B$56),'Input Calculation'!$A$2:$AJ$29,9),\"\")","v":""},{"$f":"_xlfn.IFNA(VLOOKUP($C56,'Product Information'!$A$2:$C$31,2),\"\")","v":""},{"$f":"_xlfn.IFNA(VLOOKUP($C56,'Product Information'!$A$2:$C$31,3),\"\")","v":""}]
[null,null,{"$f":"IFERROR(VLOOKUP(VALUE($B$56),'Input Calculation'!$A$2:$AJ$29,11),\"\")","v":""},{"$f":"_xlfn.IFNA(VLOOKUP($C57,'Product Information'!$A$2:$C$31,2),\"\")","v":""},{"$f":"_xlfn.IFNA(VLOOKUP($C57,'Product Information'!$A$2:$C$31,3),\"\")","v":""}]
[null,null,{"$f":"IFERROR(VLOOKUP(VALUE($B$56),'Input Calculation'!$A$2:$AJ$29,13),\"\")","v":""},{"$f":"_xlfn.IFNA(VLOOKUP($C58,'Product Information'!$A$2:$C$31,2),\"\")","v":""},{"$f":"_xlfn.IFNA(VLOOKUP($C58,'Product Information'!$A$2:$C$31,3),\"\")","v":""}]
[null,null,{"$f":"IFERROR(VLOOKUP(VALUE($B$56),'Input Calculation'!$A$2:$AJ$29,15),\"\")","v":""},{"$f":"_xlfn.IFNA(VLOOKUP($C59,'Product Information'!$A$2:$C$31,2),\"\")","v":""},{"$f":"_xlfn.IFNA(VLOOKUP($C59,'Product Information'!$A$2:$C$31,3),\"\")","v":""}]
[null,null,{"$f":"IFERROR(VLOOKUP(VALUE($B$56),'Input Calculation'!$A$2:$AJ$29,17),\"\")","v":""},{"$f":"_xlfn.IFNA(VLOOKUP($C60,'Product Information'!$A$2:$C$31,2),\"\")","v":""},{"$f":"_xlfn.IFNA(VLOOKUP($C60,'Product Information'!$A$2:$C$31,3),\"\")","v":""}]
[null,null,{"$f":"IFERROR(VLOOKUP(VALUE($B$56),'Input Calculation'!$A$2:$AJ$29,19),\"\")","v":""},{"$f":"_xlfn.IFNA(VLOOKUP($C61,'Product Information'!$A$2:$C$31,2),\"\")","v":""},{"$f":"_xlfn.IFNA(VLOOKUP($C61,'Product Information'!$A$2:$C$31,3),\"\")","v":""}]
[null,null,{"$f":"IFERROR(VLOOKUP(VALUE($B$56),'Input Calculation'!$A$2:$AJ$29,21),\"\")","v":""},{"$f":"_xlfn.IFNA(VLOOKUP($C62,'Product Information'!$A$2:$C$31,2),\"\")","v":""},{"$f":"_xlfn.IFNA(VLOOKUP($C62,'Product Information'!$A$2:$C$31,3),\"\")","v":""}]
[null,null,{"$f":"IFERROR(VLOOKUP(VALUE($B$56),'Input Calculation'!$A$2:$AJ$29,23),\"\")","v":""},{"$f":"_xlfn.IFNA(VLOOKUP($C63,'Product Information'!$A$2:$C$31,2),\"\")","v":""},{"$f":"_xlfn.IFNA(VLOOKUP($C63,'Product Information'!$A$2:$C$31,3),\"\")","v":""}]
[null,null,{"$f":"IFERROR(VLOOKUP(VALUE($B$56),'Input Calculation'!$A$2:$AJ$29,25),\"\")","v":""},{"$f":"_xlfn.IFNA(VLOOKUP($C64,'Product Information'!$A$2:$C$31,2),\"\")","v":""},{"$f":"_xlfn.IFNA(VLOOKUP($C64,'Product Information'!$A$2:$C$31,3),\"\")","v":""}]
[null,null,{"$f":"IFERROR(VLOOKUP(VALUE($B$56),'Input Calculation'!$A$2:$AJ$29,27),\"\")","v":""},{"$f":"_xlfn.IFNA(VLOOKUP($C65,'Product Information'!$A$2:$C$31,2),\"\")","v":""},{"$f":"_xlfn.IFNA(VLOOKUP($C65,'Product Information'!$A$2:$C$31,3),\"\")","v":""}]
[null,null,null,"Total:",{"$f":"IFERROR(VLOOKUP(VALUE($B$56),'Input Calculation'!$A$2:$AJ$29,36),\"\")","v":""},"Notes: "]
[]
[null,{"$f":"MID($A$7,LEN(B8)+LEN(B20)+LEN(B32)+LEN(B44)+LEN(B56)+1,4)","v":""},{"$f":"IFERROR(VLOOKUP(VALUE($B$68),'Input Calculation'!$A$2:$AJ$29,9),\"\")","v":""},{"$f":"_xlfn.IFNA(VLOOKUP($C68,'Product Information'!$A$2:$C$31,2),\"\")","v":""},{"$f":"_xlfn.IFNA(VLOOKUP($C68,'Product Information'!$A$2:$C$31,3),\"\")","v":""}]
[null,null,{"$f":"IFERROR(VLOOKUP(VALUE($B$68),'Input Calculation'!$A$2:$AJ$29,11),\"\")","v":""},{"$f":"_xlfn.IFNA(VLOOKUP($C69,'Product Information'!$A$2:$C$31,2),\"\")","v":""},{"$f":"_xlfn.IFNA(VLOOKUP($C69,'Product Information'!$A$2:$C$31,3),\"\")","v":""}]
[null,null,{"$f":"IFERROR(VLOOKUP(VALUE($B$68),'Input Calculation'!$A$2:$AJ$29,13),\"\")","v":""},{"$f":"_xlfn.IFNA(VLOOKUP($C70,'Product Information'!$A$2:$C$31,2),\"\")","v":""},{"$f":"_xlfn.IFNA(VLOOKUP($C70,'Product Information'!$A$2:$C$31,3),\"\")","v":""}]
[null,null,{"$f":"IFERROR(VLOOKUP(VALUE($B$68),'Input Calculation'!$A$2:$AJ$29,15),\"\")","v":""},{"$f":"_xlfn.IFNA(VLOOKUP($C71,'Product Information'!$A$2:$C$31,2),\"\")","v":""},{"$f":"_xlfn.IFNA(VLOOKUP($C71,'Product Information'!$A$2:$C$31,3),\"\")","v":""}]
[null,null,{"$f":"IFERROR(VLOOKUP(VALUE($B$68),'Input Calculation'!$A$2:$AJ$29,17),\"\")","v":""},{"$f":"_xlfn.IFNA(VLOOKUP($C72,'Product Information'!$A$2:$C$31,2),\"\")","v":""},{"$f":"_xlfn.IFNA(VLOOKUP($C72,'Product Information'!$A$2:$C$31,3),\"\")","v":""}]
[null,null,{"$f":"IFERROR(VLOOKUP(VALUE($B$68),'Input Calculation'!$A$2:$AJ$29,19),\"\")","v":""},{"$f":"_xlfn.IFNA(VLOOKUP($C73,'Product Information'!$A$2:$C$31,2),\"\")","v":""},{"$f":"_xlfn.IFNA(VLOOKUP($C73,'Product Information'!$A$2:$C$31,3),\"\")","v":""}]
[null,null,{"$f":"IFERROR(VLOOKUP(VALUE($B$68),'Input Calculation'!$A$2:$AJ$29,21),\"\")","v":""},{"$f":"_xlfn.IFNA(VLOOKUP($C74,'Product Information'!$A$2:$C$31,2),\"\")","v":""},{"$f":"_xlfn.IFNA(VLOOKUP($C74,'Product Information'!$A$2:$C$31,3),\"\")","v":""}]
[null,null,{"$f":"IFERROR(VLOOKUP(VALUE($B$68),'Input Calculation'!$A$2:$AJ$29,23),\"\")","v":""},{"$f":"_xlfn.IFNA(VLOOKUP($C75,'Product Information'!$A$2:$C$31,2),\"\")","v":""},{"$f":"_xlfn.IFNA(VLOOKUP($C75,'Product Information'!$A$2:$C$31,3),\"\")","v":""}]
[null,null,{"$f":"IFERROR(VLOOKUP(VALUE($B$68),'Input Calculation'!$A$2:$AJ$29,25),\"\")","v":""},{"$f":"_xlfn.IFNA(VLOOKUP($C76,'Product Information'!$A$2:$C$31,2),\"\")","v":""},{"$f":"_xlfn.IFNA(VLOOKUP($C76,'Product Information'!$A$2:$C$31,3),\"\")","v":""}]
[null,null,{"$f":"IFERROR(VLOOKUP(VALUE($B$68),'Input Calculation'!$A$2:$AJ$29,27),\"\")","v":""},{"$f":"_xlfn.IFNA(VLOOKUP($C77,'Product Information'!$A$2:$C$31,2),\"\")","v":""},{"$f":"_xlfn.IFNA(VLOOKUP($C77,'Product Information'!$A$2:$C$31,3),\"\")","v":""}]
[null,null,null,"Total:",{"$f":"IFERROR(VLOOKUP(VALUE($B$68),'Input Calculation'!$A$2:$AJ$29,36),\"\")","v":""},"Notes: "]

{"sheet":"8174368834","index":14,"n_rows":78,"n_cols":6,"rows_kept":78,"cut":false,"hidden":true,"merged":[]}
["Name:",{"$f":"VLOOKUP(8174368834,'Customer Information'!$A$2:$I$12,2)","v":"Doe John"}]
["Phone:",{"$f":"TEXT(8174368834,\"###-###-####\")","v":"817-436-8834"}]
["Email:",{"$f":"VLOOKUP(8174368834,'Customer Information'!$A$2:$I$12,3)","v":"noone@yahoo.com"}]
["Address:",{"$f":"CONCATENATE(VLOOKUP(8174368834,'Customer Information'!$A$2:$I$12,4),\", \",VLOOKUP(8174368834,'Customer Information'!$A$2:$I$12,5),\", \",VLOOKUP(8174368834,'Customer Information'!$A$2:$I$12,6),\" \",VLOOKUP(8174368834,'Customer Information'!$A$2:$I$12,7))","v":"1000 Main Street, Los Angeles, CA 98845"}]
["Customer Since:",{"$f":"VLOOKUP(8174368834,'Customer Information'!$A$2:$I$12,8)","v":2017}]
["Good Standing:",{"$f":"VLOOKUP(8174368834,'Customer Information'!$A$2:$I$12,9)","v":"Yes"}]
[{"$f":"CONCATENATE(A8,A9,A10,A11,A12,A13,A14,A15,A16,A17,A18,A19,A20,A21,A22,A23,A24,A25,A26,A27,A28,A29,A30,A31,A32,A33,A34,A35,A36)","v":"100210141021"},"Order Number"]
[{"$f":"IF('Input Calculation'!B2=8174368834,'Input Calculation'!A2,\"\")","v":""},{"$f":"MID($A$7,ROW()-7,4)","v":"1002"},{"$f":"IFERROR(VLOOKUP(VALUE($B$8),'Input Calculation'!$A$2:$AJ$29,9),\"\")","v":2056772},{"$f":"_xlfn.IFNA(VLOOKUP($C8,'Product Information'!$A$2:$C$31,2),\"\")","v":"Great Pants"},{"$f":"_xlfn.IFNA(VLOOKUP($C8,'Product Information'!$A$2:$C$31,3),\"\")","v":74.989999999999995}]
[{"$f":"IF('Input Calculation'!B3=8174368834,'Input Calculation'!A3,\"\")","v":1002},null,{"$f":"IFERROR(VLOOKUP(VALUE($B$8),'Input Calculation'!$A$2:$AJ$29,11),\"\")","v":3055845},{"$f":"_xlfn.IFNA(VLOOKUP($C9,'Product Information'!$A$2:$C$31,2),\"\")","v":"Winter Jacket"},{"$f":"_xlfn.IFNA(VLOOKUP($C9,'Product Information'!$A$2:$C$31,3),\"\")","v":199.99}]
[{"$f":"IF('Input Calculation'!B4=8174368834,'Input Calculation'!A4,\"\")","v":""},null,{"$f":"IFERROR(VLOOKUP(VALUE($B$8),'Input Calculation'!$A$2:$AJ$29,13),\"\")","v":""},{"$f":"_xlfn.IFNA(VLOOKUP($C10,'Product Information'!$A$2:$C$31,2),\"\")","v":""},{"$f":"_xlfn.IFNA(VLOOKUP($C10,'Product Information'!$A$2:$C$31,3),\"\")","v":""}]
[{"$f":"IF('Input Calculation'!B5=8174368834,'Input Calculation'!A5,\"\")","v":""},null,{"$f":"IFERROR(VLOOKUP(VALUE($B$8),'Input Calculation'!$A$2:$AJ$29,15),\"\")","v":""},{"$f":"_xlfn.IFNA(VLOOKUP($C11,'Product Information'!$A$2:$C$31,2),\"\")","v":""},{"$f":"_xlfn.IFNA(VLOOKUP($C11,'Product Information'!$A$2:$C$31,3),\"\")","v":""}]
[{"$f":"IF('Input Calculation'!B6=8174368834,'Input Calculation'!A6,\"\")","v":""},null,{"$f":"IFERROR(VLOOKUP(VALUE($B$8),'Input Calculation'!$A$2:$AJ$29,17),\"\")","v":""},{"$f":"_xlfn.IFNA(VLOOKUP($C12,'Product Information'!$A$2:$C$31,2),\"\")","v":""},{"$f":"_xlfn.IFNA(VLOOKUP($C12,'Product Information'!$A$2:$C$31,3),\"\")","v":""}]
[{"$f":"IF('Input Calculation'!B7=8174368834,'Input Calculation'!A7,\"\")","v":""},null,{"$f":"IFERROR(VLOOKUP(VALUE($B$8),'Input Calculation'!$A$2:$AJ$29,19),\"\")","v":""},{"$f":"_xlfn.IFNA(VLOOKUP($C13,'Product Information'!$A$2:$C$31,2),\"\")","v":""},{"$f":"_xlfn.IFNA(VLOOKUP($C13,'Product Information'!$A$2:$C$31,3),\"\")","v":""}]
[{"$f":"IF('Input Calculation'!B8=8174368834,'Input Calculation'!A8,\"\")","v":""},null,{"$f":"IFERROR(VLOOKUP(VALUE($B$8),'Input Calculation'!$A$2:$AJ$29,21),\"\")","v":""},{"$f":"_xlfn.IFNA(VLOOKUP($C14,'Product Information'!$A$2:$C$31,2),\"\")","v":""},{"$f":"_xlfn.IFNA(VLOOKUP($C14,'Product Information'!$A$2:$C$31,3),\"\")","v":""}]
[{"$f":"IF('Input Calculation'!B9=8174368834,'Input Calculation'!A9,\"\")","v":""},null,{"$f":"IFERROR(VLOOKUP(VALUE($B$8),'Input Calculation'!$A$2:$AJ$29,23),\"\")","v":""},{"$f":"_xlfn.IFNA(VLOOKUP($C15,'Product Information'!$A$2:$C$31,2),\"\")","v":""},{"$f":"_xlfn.IFNA(VLOOKUP($C15,'Product Information'!$A$2:$C$31,3),\"\")","v":""}]
[{"$f":"IF('Input Calculation'!B10=8174368834,'Input Calculation'!A10,\"\")","v":""},null,{"$f":"IFERROR(VLOOKUP(VALUE($B$8),'Input Calculation'!$A$2:$AJ$29,25),\"\")","v":""},{"$f":"_xlfn.IFNA(VLOOKUP($C16,'Product Information'!$A$2:$C$31,2),\"\")","v":""},{"$f":"_xlfn.IFNA(VLOOKUP($C16,'Product Information'!$A$2:$C$31,3),\"\")","v":""}]
[{"$f":"IF('Input Calculation'!B11=8174368834,'Input Calculation'!A11,\"\")","v":""},null,{"$f":"IFERROR(VLOOKUP(VALUE($B$8),'Input Calculation'!$A$2:$AJ$29,27),\"\")","v":""},{"$f":"_xlfn.IFNA(VLOOKUP($C17,'Product Information'!$A$2:$C$31,2),\"\")","v":""},{"$f":"_xlfn.IFNA(VLOOKUP($C17,'Product Information'!$A$2:$C$31,3),\"\")","v":""}]
[{"$f":"IF('Input Calculation'!B12=8174368834,'Input Calculation'!A12,\"\")","v":""},null,null,"Total:",{"$f":"VLOOKUP(VALUE($B$8),'Input Calculation'!$A$2:$AJ$29,36)","v":303.79000000000002},"Notes: "]
[{"$f":"IF('Input Calculation'!B13=8174368834,'Input Calculation'!A13,\"\")","v":""}]
[{"$f":"IF('Input Calculation'!B14=8174368834,'Input Calculation'!A14,\"\")","v":""},{"$f":"MID($A$7,LEN(B8)+1,4)","v":"1014"},{"$f":"IFERROR(VLOOKUP(VALUE($B$20),'Input Calculation'!$A$2:$AJ$29,9),\"\")","v":7250412},{"$f":"_xlfn.IFNA(VLOOKUP($C20,'Product Information'!$A$2:$C$31,2),\"\")","v":"Thermal Socks"},{"$f":"_xlfn.IFNA(VLOOKUP($C20,'Product Information'!$A$2:$C$31,3),\"\")","v":12.99}]
[{"$f":"IF('Input Calculation'!B15=8174368834,'Input Calculation'!A15,\"\")","v":1014},null,{"$f":"IFERROR(VLOOKUP(VALUE($B$20),'Input Calculation'!$A$2:$AJ$29,11),\"\")","v":""},{"$f":"_xlfn.IFNA(VLOOKUP($C21,'Product Information'!$A$2:$C$31,2),\"\")","v":""},{"$f":"_xlfn.IFNA(VLOOKUP($C21,'Product Information'!$A$2:$C$31,3),\"\")","v":""}]
[{"$f":"IF('Input Calculation'!B16=8174368834,'Input Calculation'!A16,\"\")","v":""},null,{"$f":"IFERROR(VLOOKUP(VALUE($B$20),'Input Calculation'!$A$2:$AJ$29,13),\"\")","v":""},{"$f":"_xlfn.IFNA(VLOOKUP($C22,'Product Information'!$A$2:$C$31,2),\"\")","v":""},{"$f":"_xlfn.IFNA(VLOOKUP($C22,'Product Information'!$A$2:$C$31,3),\"\")","v":""}]
[{"$f":"IF('Input Calculation'!B17=8174368834,'Input Calculation'!A17,\"\")","v":""},null,{"$f":"IFERROR(VLOOKUP(VALUE($B$20),'Input Calculation'!$A$2:$AJ$29,15),\"\")","v":""},{"$f":"_xlfn.IFNA(VLOOKUP($C23,'Product Information'!$A$2:$C$31,2),\"\")","v":""},{"$f":"_xlfn.IFNA(VLOOKUP($C23,'Product Information'!$A$2:$C$31,3),\"\")","v":""}]
[{"$f":"IF('Input Calculation'!B18=8174368834,'Input Calculation'!A18,\"\")","v":""},null,{"$f":"IFERROR(VLOOKUP(VALUE($B$20),'Input Calculation'!$A$2:$AJ$29,17),\"\")","v":""},{"$f":"_xlfn.IFNA(VLOOKUP($C24,'Product Information'!$A$2:$C$31,2),\"\")","v":""},{"$f":"_xlfn.IFNA(VLOOKUP($C24,'Product Information'!$A$2:$C$31,3),\"\")","v":""}]
[{"$f":"IF('Input Calculation'!B19=8174368834,'Input Calculation'!A19,\"\")","v":""},null,{"$f":"IFERROR(VLOOKUP(VALUE($B$20),'Input Calculation'!$A$2:$AJ$29,19),\"\")","v":""},{"$f":"_xlfn.IFNA(VLOOKUP($C25,'Product Information'!$A$2:$C$31,2),\"\")","v":""},{"$f":"_xlfn.IFNA(VLOOKUP($C25,'Product Information'!$A$2:$C$31,3),\"\")","v":""}]
[{"$f":"IF('Input Calculation'!B20=8174368834,'Input Calculation'!A20,\"\")","v":""},null,{"$f":"IFERROR(VLOOKUP(VALUE($B$20),'Input Calculation'!$A$2:$AJ$29,21),\"\")","v":""},{"$f":"_xlfn.IFNA(VLOOKUP($C26,'Product Information'!$A$2:$C$31,2),\"\")","v":""},{"$f":"_xlfn.IFNA(VLOOKUP($C26,'Product Information'!$A$2:$C$31,3),\"\")","v":""}]
[{"$f":"IF('Input Calculation'!B21=8174368834,'Input Calculation'!A21,\"\")","v":""},null,{"$f":"IFERROR(VLOOKUP(VALUE($B$20),'Input Calculation'!$A$2:$AJ$29,23),\"\")","v":""},{"$f":"_xlfn.IFNA(VLOOKUP($C27,'Product Information'!$A$2:$C$31,2),\"\")","v":""},{"$f":"_xlfn.IFNA(VLOOKUP($C27,'Product Information'!$A$2:$C$31,3),\"\")","v":""}]
[{"$f":"IF('Input Calculation'!B22=8174368834,'Input Calculation'!A22,\"\")","v":1021},null,{"$f":"IFERROR(VLOOKUP(VALUE($B$20),'Input Calculation'!$A$2:$AJ$29,25),\"\")","v":""},{"$f":"_xlfn.IFNA(VLOOKUP($C28,'Product Information'!$A$2:$C$31,2),\"\")","v":""},{"$f":"_xlfn.IFNA(VLOOKUP($C28,'Product Information'!$A$2:$C$31,3),\"\")","v":""}]
[{"$f":"IF('Input Calculation'!B23=8174368834,'Input Calculation'!A23,\"\")","v":""},null,{"$f":"IFERROR(VLOOKUP(VALUE($B$20),'Input Calculation'!$A$2:$AJ$29,27),\"\")","v":""},{"$f":"_xlfn.IFNA(VLOOKUP($C29,'Product Information'!$A$2:$C$31,2),\"\")","v":""},{"$f":"_xlfn.IFNA(VLOOKUP($C29,'Product Information'!$A$2:$C$31,3),\"\")","v":""}]
[{"$f":"IF('Input Calculation'!B24=8174368834,'Input Calculation'!A24,\"\")","v":""},null,null,"Total:",{"$f":"IFERROR(VLOOKUP(VALUE($B$20),'Input Calculation'!$A$2:$AJ$29,36),\"\")","v":15.408999999999999},"Notes: "]
[{"$f":"IF('Input Calculation'!B25=8174368834,'Input Calculation'!A25,\"\")","v":""}]
[{"$f":"IF('Input Calculation'!B26=8174368834,'Input Calculation'!A26,\"\")","v":""},{"$f":"MID($A$7,LEN(B8)+LEN(B20)+1,4)","v":"1021"},{"$f":"IFERROR(VLOOKUP(VALUE($B$32),'Input Calculation'!$A$2:$AJ$29,9),\"\")","v":5216388},{"$f":"_xlfn.IFNA(VLOOKUP($C32,'Product Information'!$A$2:$C$31,2),\"\")","v":"Logo Hat"},{"$f":"_xlfn.IFNA(VLOOKUP($C32,'Product Information'!$A$2:$C$31,3),\"\")","v":49.99}]
[{"$f":"IF('Input Calculation'!B27=8174368834,'Input Calculation'!A27,\"\")","v":""},null,{"$f":"IFERROR(VLOOKUP(VALUE($B$32),'Input Calculation'!$A$2:$AJ$29,11),\"\")","v":""},{"$f":"_xlfn.IFNA(VLOOKUP($C33,'Product Information'!$A$2:$C$31,2),\"\")","v":""},{"$f":"_xlfn.IFNA(VLOOKUP($C33,'Product Information'!$A$2:$C$31,3),\"\")","v":""}]
[{"$f":"IF('Input Calculation'!B28=8174368834,'Input Calculation'!A28,\"\")","v":""},null,{"$f":"IFERROR(VLOOKUP(VALUE($B$32),'Input Calculation'!$A$2:$AJ$29,13),\"\")","v":""},{"$f":"_xlfn.IFNA(VLOOKUP($C34,'Product Information'!$A$2:$C$31,2),\"\")","v":""},{"$f":"_xlfn.IFNA(VLOOKUP($C34,'Product Information'!$A$2:$C$31,3),\"\")","v":""}]
[{"$f":"IF('Input Calculation'!B29=8174368834,'Input Calculation'!A29,\"\")","v":""},null,{"$f":"IFERROR(VLOOKUP(VALUE($B$32),'Input Calculation'!$A$2:$AJ$29,15),\"\")","v":""},{"$f":"_xlfn.IFNA(VLOOKUP($C35,'Product Information'!$A$2:$C$31,2),\"\")","v":""},{"$f":"_xlfn.IFNA(VLOOKUP($C35,'Product Information'!$A$2:$C$31,3),\"\")","v":""}]
[{"$f":"IF('Input Calculation'!B30=8174368834,'Input Calculation'!A30,\"\")","v":""},null,{"$f":"IFERROR(VLOOKUP(VALUE($B$32),'Input Calculation'!$A$2:$AJ$29,17),\"\")","v":""},{"$f":"_xlfn.IFNA(VLOOKUP($C36,'Product Information'!$A$2:$C$31,2),\"\")","v":""},{"$f":"_xlfn.IFNA(VLOOKUP($C36,'Product Information'!$A$2:$C$31,3),\"\")","v":""}]
[null,null,{"$f":"IFERROR(VLOOKUP(VALUE($B$32),'Input Calculation'!$A$2:$AJ$29,19),\"\")","v":""},{"$f":"_xlfn.IFNA(VLOOKUP($C37,'Product Information'!$A$2:$C$31,2),\"\")","v":""},{"$f":"_xlfn.IFNA(VLOOKUP($C37,'Product Information'!$A$2:$C$31,3),\"\")","v":""}]
[null,null,{"$f":"IFERROR(VLOOKUP(VALUE($B$32),'Input Calculation'!$A$2:$AJ$29,21),\"\")","v":""},{"$f":"_xlfn.IFNA(VLOOKUP($C38,'Product Information'!$A$2:$C$31,2),\"\")","v":""},{"$f":"_xlfn.IFNA(VLOOKUP($C38,'Product Information'!$A$2:$C$31,3),\"\")","v":""}]
[null,null,{"$f":"IFERROR(VLOOKUP(VALUE($B$32),'Input Calculation'!$A$2:$AJ$29,23),\"\")","v":""},{"$f":"_xlfn.IFNA(VLOOKUP($C39,'Product Information'!$A$2:$C$31,2),\"\")","v":""},{"$f":"_xlfn.IFNA(VLOOKUP($C39,'Product Information'!$A$2:$C$31,3),\"\")","v":""}]
[null,null,{"$f":"IFERROR(VLOOKUP(VALUE($B$32),'Input Calculation'!$A$2:$AJ$29,25),\"\")","v":""},{"$f":"_xlfn.IFNA(VLOOKUP($C40,'Product Information'!$A$2:$C$31,2),\"\")","v":""},{"$f":"_xlfn.IFNA(VLOOKUP($C40,'Product Information'!$A$2:$C$31,3),\"\")","v":""}]
[null,null,{"$f":"IFERROR(VLOOKUP(VALUE($B$32),'Input Calculation'!$A$2:$AJ$29,27),\"\")","v":""},{"$f":"_xlfn.IFNA(VLOOKUP($C41,'Product Information'!$A$2:$C$31,2),\"\")","v":""},{"$f":"_xlfn.IFNA(VLOOKUP($C41,'Product Information'!$A$2:$C$31,3),\"\")","v":""}]
[null,null,null,"Total:",{"$f":"IFERROR(VLOOKUP(VALUE($B$32),'Input Calculation'!$A$2:$AJ$29,36),\"\")","v":59.309000000000005},"Notes: "]
[]
[null,{"$f":"MID($A$7,LEN(B8)+LEN(B20)+LEN(B32)+1,4)","v":""},{"$f":"IFERROR(VLOOKUP(VALUE($B$44),'Input Calculation'!$A$2:$AJ$29,9),\"\")","v":""},{"$f":"_xlfn.IFNA(VLOOKUP($C44,'Product Information'!$A$2:$C$31,2),\"\")","v":""},{"$f":"_xlfn.IFNA(VLOOKUP($C44,'Product Information'!$A$2:$C$31,3),\"\")","v":""}]
[null,null,{"$f":"IFERROR(VLOOKUP(VALUE($B$44),'Input Calculation'!$A$2:$AJ$29,11),\"\")","v":""},{"$f":"_xlfn.IFNA(VLOOKUP($C45,'Product Information'!$A$2:$C$31,2),\"\")","v":""},{"$f":"_xlfn.IFNA(VLOOKUP($C45,'Product Information'!$A$2:$C$31,3),\"\")","v":""}]
[null,null,{"$f":"IFERROR(VLOOKUP(VALUE($B$44),'Input Calculation'!$A$2:$AJ$29,13),\"\")","v":""},{"$f":"_xlfn.IFNA(VLOOKUP($C46,'Product Information'!$A$2:$C$31,2),\"\")","v":""},{"$f":"_xlfn.IFNA(VLOOKUP($C46,'Product Information'!$A$2:$C$31,3),\"\")","v":""}]
[null,null,{"$f":"IFERROR(VLOOKUP(VALUE($B$44),'Input Calculation'!$A$2:$AJ$29,15),\"\")","v":""},{"$f":"_xlfn.IFNA(VLOOKUP($C47,'Product Information'!$A$2:$C$31,2),\"\")","v":""},{"$f":"_xlfn.IFNA(VLOOKUP($C47,'Product Information'!$A$2:$C$31,3),\"\")","v":""}]
[null,null,{"$f":"IFERROR(VLOOKUP(VALUE($B$44),'Input Calculation'!$A$2:$AJ$29,17),\"\")","v":""},{"$f":"_xlfn.IFNA(VLOOKUP($C48,'Product Information'!$A$2:$C$31,2),\"\")","v":""},{"$f":"_xlfn.IFNA(VLOOKUP($C48,'Product Information'!$A$2:$C$31,3),\"\")","v":""}]
[null,null,{"$f":"IFERROR(VLOOKUP(VALUE($B$44),'Input Calculation'!$A$2:$AJ$29,19),\"\")","v":""},{"$f":"_xlfn.IFNA(VLOOKUP($C49,'Product Information'!$A$2:$C$31,2),\"\")","v":""},{"$f":"_xlfn.IFNA(VLOOKUP($C49,'Product Information'!$A$2:$C$31,3),\"\")","v":""}]
[null,null,{"$f":"IFERROR(VLOOKUP(VALUE($B$44),'Input Calculation'!$A$2:$AJ$29,21),\"\")","v":""},{"$f":"_xlfn.IFNA(VLOOKUP($C50,'Product Information'!$A$2:$C$31,2),\"\")","v":""},{"$f":"_xlfn.IFNA(VLOOKUP($C50,'Product Information'!$A$2:$C$31,3),\"\")","v":""}]
[null,null,{"$f":"IFERROR(VLOOKUP(VALUE($B$44),'Input Calculation'!$A$2:$AJ$29,23),\"\")","v":""},{"$f":"_xlfn.IFNA(VLOOKUP($C51,'Product Information'!$A$2:$C$31,2),\"\")","v":""},{"$f":"_xlfn.IFNA(VLOOKUP($C51,'Product Information'!$A$2:$C$31,3),\"\")","v":""}]
[null,null,{"$f":"IFERROR(VLOOKUP(VALUE($B$44),'Input Calculation'!$A$2:$AJ$29,25),\"\")","v":""},{"$f":"_xlfn.IFNA(VLOOKUP($C52,'Product Information'!$A$2:$C$31,2),\"\")","v":""},{"$f":"_xlfn.IFNA(VLOOKUP($C52,'Product Information'!$A$2:$C$31,3),\"\")","v":""}]
[null,null,{"$f":"IFERROR(VLOOKUP(VALUE($B$44),'Input Calculation'!$A$2:$AJ$29,27),\"\")","v":""},{"$f":"_xlfn.IFNA(VLOOKUP($C53,'Product Information'!$A$2:$C$31,2),\"\")","v":""},{"$f":"_xlfn.IFNA(VLOOKUP($C53,'Product Information'!$A$2:$C$31,3),\"\")","v":""}]
[null,null,null,"Total:",{"$f":"IFERROR(VLOOKUP(VALUE($B$44),'Input Calculation'!$A$2:$AJ$29,36),\"\")","v":""},"Notes: "]
[]
[null,{"$f":"MID($A$7,LEN(B8)+LEN(B20)+LEN(B32)+LEN(B44)+1,4)","v":""},{"$f":"IFERROR(VLOOKUP(VALUE($B$56),'Input Calculation'!$A$2:$AJ$29,9),\"\")","v":""},{"$f":"_xlfn.IFNA(VLOOKUP($C56,'Product Information'!$A$2:$C$31,2),\"\")","v":""},{"$f":"_xlfn.IFNA(VLOOKUP($C56,'Product Information'!$A$2:$C$31,3),\"\")","v":""}]
[null,null,{"$f":"IFERROR(VLOOKUP(VALUE($B$56),'Input Calculation'!$A$2:$AJ$29,11),\"\")","v":""},{"$f":"_xlfn.IFNA(VLOOKUP($C57,'Product Information'!$A$2:$C$31,2),\"\")","v":""},{"$f":"_xlfn.IFNA(VLOOKUP($C57,'Product Information'!$A$2:$C$31,3),\"\")","v":""}]
[null,null,{"$f":"IFERROR(VLOOKUP(VALUE($B$56),'Input Calculation'!$A$2:$AJ$29,13),\"\")","v":""},{"$f":"_xlfn.IFNA(VLOOKUP($C58,'Product Information'!$A$2:$C$31,2),\"\")","v":""},{"$f":"_xlfn.IFNA(VLOOKUP($C58,'Product Information'!$A$2:$C$31,3),\"\")","v":""}]
[null,null,{"$f":"IFERROR(VLOOKUP(VALUE($B$56),'Input Calculation'!$A$2:$AJ$29,15),\"\")","v":""},{"$f":"_xlfn.IFNA(VLOOKUP($C59,'Product Information'!$A$2:$C$31,2),\"\")","v":""},{"$f":"_xlfn.IFNA(VLOOKUP($C59,'Product Information'!$A$2:$C$31,3),\"\")","v":""}]
[null,null,{"$f":"IFERROR(VLOOKUP(VALUE($B$56),'Input Calculation'!$A$2:$AJ$29,17),\"\")","v":""},{"$f":"_xlfn.IFNA(VLOOKUP($C60,'Product Information'!$A$2:$C$31,2),\"\")","v":""},{"$f":"_xlfn.IFNA(VLOOKUP($C60,'Product Information'!$A$2:$C$31,3),\"\")","v":""}]
[null,null,{"$f":"IFERROR(VLOOKUP(VALUE($B$56),'Input Calculation'!$A$2:$AJ$29,19),\"\")","v":""},{"$f":"_xlfn.IFNA(VLOOKUP($C61,'Product Information'!$A$2:$C$31,2),\"\")","v":""},{"$f":"_xlfn.IFNA(VLOOKUP($C61,'Product Information'!$A$2:$C$31,3),\"\")","v":""}]
[null,null,{"$f":"IFERROR(VLOOKUP(VALUE($B$56),'Input Calculation'!$A$2:$AJ$29,21),\"\")","v":""},{"$f":"_xlfn.IFNA(VLOOKUP($C62,'Product Information'!$A$2:$C$31,2),\"\")","v":""},{"$f":"_xlfn.IFNA(VLOOKUP($C62,'Product Information'!$A$2:$C$31,3),\"\")","v":""}]
[null,null,{"$f":"IFERROR(VLOOKUP(VALUE($B$56),'Input Calculation'!$A$2:$AJ$29,23),\"\")","v":""},{"$f":"_xlfn.IFNA(VLOOKUP($C63,'Product Information'!$A$2:$C$31,2),\"\")","v":""},{"$f":"_xlfn.IFNA(VLOOKUP($C63,'Product Information'!$A$2:$C$31,3),\"\")","v":""}]
[null,null,{"$f":"IFERROR(VLOOKUP(VALUE($B$56),'Input Calculation'!$A$2:$AJ$29,25),\"\")","v":""},{"$f":"_xlfn.IFNA(VLOOKUP($C64,'Product Information'!$A$2:$C$31,2),\"\")","v":""},{"$f":"_xlfn.IFNA(VLOOKUP($C64,'Product Information'!$A$2:$C$31,3),\"\")","v":""}]
[null,null,{"$f":"IFERROR(VLOOKUP(VALUE($B$56),'Input Calculation'!$A$2:$AJ$29,27),\"\")","v":""},{"$f":"_xlfn.IFNA(VLOOKUP($C65,'Product Information'!$A$2:$C$31,2),\"\")","v":""},{"$f":"_xlfn.IFNA(VLOOKUP($C65,'Product Information'!$A$2:$C$31,3),\"\")","v":""}]
[null,null,null,"Total:",{"$f":"IFERROR(VLOOKUP(VALUE($B$56),'Input Calculation'!$A$2:$AJ$29,36),\"\")","v":""},"Notes: "]
[]
[null,{"$f":"MID($A$7,LEN(B8)+LEN(B20)+LEN(B32)+LEN(B44)+LEN(B56)+1,4)","v":""},{"$f":"IFERROR(VLOOKUP(VALUE($B$68),'Input Calculation'!$A$2:$AJ$29,9),\"\")","v":""},{"$f":"_xlfn.IFNA(VLOOKUP($C68,'Product Information'!$A$2:$C$31,2),\"\")","v":""},{"$f":"_xlfn.IFNA(VLOOKUP($C68,'Product Information'!$A$2:$C$31,3),\"\")","v":""}]
[null,null,{"$f":"IFERROR(VLOOKUP(VALUE($B$68),'Input Calculation'!$A$2:$AJ$29,11),\"\")","v":""},{"$f":"_xlfn.IFNA(VLOOKUP($C69,'Product Information'!$A$2:$C$31,2),\"\")","v":""},{"$f":"_xlfn.IFNA(VLOOKUP($C69,'Product Information'!$A$2:$C$31,3),\"\")","v":""}]
[null,null,{"$f":"IFERROR(VLOOKUP(VALUE($B$68),'Input Calculation'!$A$2:$AJ$29,13),\"\")","v":""},{"$f":"_xlfn.IFNA(VLOOKUP($C70,'Product Information'!$A$2:$C$31,2),\"\")","v":""},{"$f":"_xlfn.IFNA(VLOOKUP($C70,'Product Information'!$A$2:$C$31,3),\"\")","v":""}]
[null,null,{"$f":"IFERROR(VLOOKUP(VALUE($B$68),'Input Calculation'!$A$2:$AJ$29,15),\"\")","v":""},{"$f":"_xlfn.IFNA(VLOOKUP($C71,'Product Information'!$A$2:$C$31,2),\"\")","v":""},{"$f":"_xlfn.IFNA(VLOOKUP($C71,'Product Information'!$A$2:$C$31,3),\"\")","v":""}]
[null,null,{"$f":"IFERROR(VLOOKUP(VALUE($B$68),'Input Calculation'!$A$2:$AJ$29,17),\"\")","v":""},{"$f":"_xlfn.IFNA(VLOOKUP($C72,'Product Information'!$A$2:$C$31,2),\"\")","v":""},{"$f":"_xlfn.IFNA(VLOOKUP($C72,'Product Information'!$A$2:$C$31,3),\"\")","v":""}]
[null,null,{"$f":"IFERROR(VLOOKUP(VALUE($B$68),'Input Calculation'!$A$2:$AJ$29,19),\"\")","v":""},{"$f":"_xlfn.IFNA(VLOOKUP($C73,'Product Information'!$A$2:$C$31,2),\"\")","v":""},{"$f":"_xlfn.IFNA(VLOOKUP($C73,'Product Information'!$A$2:$C$31,3),\"\")","v":""}]
[null,null,{"$f":"IFERROR(VLOOKUP(VALUE($B$68),'Input Calculation'!$A$2:$AJ$29,21),\"\")","v":""},{"$f":"_xlfn.IFNA(VLOOKUP($C74,'Product Information'!$A$2:$C$31,2),\"\")","v":""},{"$f":"_xlfn.IFNA(VLOOKUP($C74,'Product Information'!$A$2:$C$31,3),\"\")","v":""}]
[null,null,{"$f":"IFERROR(VLOOKUP(VALUE($B$68),'Input Calculation'!$A$2:$AJ$29,23),\"\")","v":""},{"$f":"_xlfn.IFNA(VLOOKUP($C75,'Product Information'!$A$2:$C$31,2),\"\")","v":""},{"$f":"_xlfn.IFNA(VLOOKUP($C75,'Product Information'!$A$2:$C$31,3),\"\")","v":""}]
[null,null,{"$f":"IFERROR(VLOOKUP(VALUE($B$68),'Input Calculation'!$A$2:$AJ$29,25),\"\")","v":""},{"$f":"_xlfn.IFNA(VLOOKUP($C76,'Product Information'!$A$2:$C$31,2),\"\")","v":""},{"$f":"_xlfn.IFNA(VLOOKUP($C76,'Product Information'!$A$2:$C$31,3),\"\")","v":""}]
[null,null,{"$f":"IFERROR(VLOOKUP(VALUE($B$68),'Input Calculation'!$A$2:$AJ$29,27),\"\")","v":""},{"$f":"_xlfn.IFNA(VLOOKUP($C77,'Product Information'!$A$2:$C$31,2),\"\")","v":""},{"$f":"_xlfn.IFNA(VLOOKUP($C77,'Product Information'!$A$2:$C$31,3),\"\")","v":""}]
[null,null,null,"Total:",{"$f":"IFERROR(VLOOKUP(VALUE($B$68),'Input Calculation'!$A$2:$AJ$29,36),\"\")","v":""},"Notes: "]

{"sheet":"8785546312","index":15,"n_rows":78,"n_cols":7,"rows_kept":78,"cut":false,"hidden":true,"merged":[]}
["Name:",{"$f":"VLOOKUP(8785546312,'Customer Information'!$A$2:$I$12,2)","v":"O'Lantern Jack"}]
["Phone:",{"$f":"TEXT(8785546312,\"###-###-####\")","v":"878-554-6312"}]
["Email:",{"$f":"VLOOKUP(8785546312,'Customer Information'!$A$2:$I$12,3)","v":"halloween@hotmail.com"}]
["Address:",{"$f":"CONCATENATE(VLOOKUP(8785546312,'Customer Information'!$A$2:$I$12,4),\", \",VLOOKUP(8785546312,'Customer Information'!$A$2:$I$12,5),\", \",VLOOKUP(8785546312,'Customer Information'!$A$2:$I$12,6),\" \",VLOOKUP(8785546312,'Customer Information'!$A$2:$I$12,7))","v":"666 Evil Road, Hell, MO 10232"}]
["Customer Since:",{"$f":"VLOOKUP(8785546312,'Customer Information'!$A$2:$I$12,8)","v":2017}]
["Good Standing:",{"$f":"VLOOKUP(8785546312,'Customer Information'!$A$2:$I$12,9)","v":"No"}]
[{"$f":"CONCATENATE(A8,A9,A10,A11,A12,A13,A14,A15,A16,A17,A18,A19,A20,A21,A22,A23,A24,A25,A26,A27,A28,A29,A30,A31,A32,A33,A34,A35,A36)","v":"100710181026"},"Order Number"]
[{"$f":"IF('Input Calculation'!B2=8785546312,'Input Calculation'!A2,\"\")","v":""},{"$f":"MID($A$7,ROW()-7,4)","v":"1007"},{"$f":"IFERROR(VLOOKUP(VALUE($B$8),'Input Calculation'!$A$2:$AJ$29,9),\"\")","v":3055845},{"$f":"_xlfn.IFNA(VLOOKUP($C8,'Product Information'!$A$2:$C$31,2),\"\")","v":"Winter Jacket"},{"$f":"_xlfn.IFNA(VLOOKUP($C8,'Product Information'!$A$2:$C$31,3),\"\")","v":199.99}]
[{"$f":"IF('Input Calculation'!B3=8785546312,'Input Calculation'!A3,\"\")","v":""},null,{"$f":"IFERROR(VLOOKUP(VALUE($B$8),'Input Calculation'!$A$2:$AJ$29,11),\"\")","v":""},{"$f":"_xlfn.IFNA(VLOOKUP($C9,'Product Information'!$A$2:$C$31,2),\"\")","v":""},{"$f":"_xlfn.IFNA(VLOOKUP($C9,'Product Information'!$A$2:$C$31,3),\"\")","v":""}]
[{"$f":"IF('Input Calculation'!B4=8785546312,'Input Calculation'!A4,\"\")","v":""},null,{"$f":"IFERROR(VLOOKUP(VALUE($B$8),'Input Calculation'!$A$2:$AJ$29,13),\"\")","v":""},{"$f":"_xlfn.IFNA(VLOOKUP($C10,'Product Information'!$A$2:$C$31,2),\"\")","v":""},{"$f":"_xlfn.IFNA(VLOOKUP($C10,'Product Information'!$A$2:$C$31,3),\"\")","v":""}]
[{"$f":"IF('Input Calculation'!B5=8785546312,'Input Calculation'!A5,\"\")","v":""},null,{"$f":"IFERROR(VLOOKUP(VALUE($B$8),'Input Calculation'!$A$2:$AJ$29,15),\"\")","v":""},{"$f":"_xlfn.IFNA(VLOOKUP($C11,'Product Information'!$A$2:$C$31,2),\"\")","v":""},{"$f":"_xlfn.IFNA(VLOOKUP($C11,'Product Information'!$A$2:$C$31,3),\"\")","v":""}]
[{"$f":"IF('Input Calculation'!B6=8785546312,'Input Calculation'!A6,\"\")","v":""},null,{"$f":"IFERROR(VLOOKUP(VALUE($B$8),'Input Calculation'!$A$2:$AJ$29,17),\"\")","v":""},{"$f":"_xlfn.IFNA(VLOOKUP($C12,'Product Information'!$A$2:$C$31,2),\"\")","v":""},{"$f":"_xlfn.IFNA(VLOOKUP($C12,'Product Information'!$A$2:$C$31,3),\"\")","v":""}]
[{"$f":"IF('Input Calculation'!B7=8785546312,'Input Calculation'!A7,\"\")","v":""},null,{"$f":"IFERROR(VLOOKUP(VALUE($B$8),'Input Calculation'!$A$2:$AJ$29,19),\"\")","v":""},{"$f":"_xlfn.IFNA(VLOOKUP($C13,'Product Information'!$A$2:$C$31,2),\"\")","v":""},{"$f":"_xlfn.IFNA(VLOOKUP($C13,'Product Information'!$A$2:$C$31,3),\"\")","v":""}]
[{"$f":"IF('Input Calculation'!B8=8785546312,'Input Calculation'!A8,\"\")","v":1007},null,{"$f":"IFERROR(VLOOKUP(VALUE($B$8),'Input Calculation'!$A$2:$AJ$29,21),\"\")","v":""},{"$f":"_xlfn.IFNA(VLOOKUP($C14,'Product Information'!$A$2:$C$31,2),\"\")","v":""},{"$f":"_xlfn.IFNA(VLOOKUP($C14,'Product Information'!$A$2:$C$31,3),\"\")","v":""}]
[{"$f":"IF('Input Calculation'!B9=8785546312,'Input Calculation'!A9,\"\")","v":""},null,{"$f":"IFERROR(VLOOKUP(VALUE($B$8),'Input Calculation'!$A$2:$AJ$29,23),\"\")","v":""},{"$f":"_xlfn.IFNA(VLOOKUP($C15,'Product Information'!$A$2:$C$31,2),\"\")","v":""},{"$f":"_xlfn.IFNA(VLOOKUP($C15,'Product Information'!$A$2:$C$31,3),\"\")","v":""}]
[{"$f":"IF('Input Calculation'!B10=8785546312,'Input Calculation'!A10,\"\")","v":""},null,{"$f":"IFERROR(VLOOKUP(VALUE($B$8),'Input Calculation'!$A$2:$AJ$29,25),\"\")","v":""},{"$f":"_xlfn.IFNA(VLOOKUP($C16,'Product Information'!$A$2:$C$31,2),\"\")","v":""},{"$f":"_xlfn.IFNA(VLOOKUP($C16,'Product Information'!$A$2:$C$31,3),\"\")","v":""}]
[{"$f":"IF('Input Calculation'!B11=8785546312,'Input Calculation'!A11,\"\")","v":""},null,{"$f":"IFERROR(VLOOKUP(VALUE($B$8),'Input Calculation'!$A$2:$AJ$29,27),\"\")","v":""},{"$f":"_xlfn.IFNA(VLOOKUP($C17,'Product Information'!$A$2:$C$31,2),\"\")","v":""},{"$f":"_xlfn.IFNA(VLOOKUP($C17,'Product Information'!$A$2:$C$31,3),\"\")","v":""}]
[{"$f":"IF('Input Calculation'!B12=8785546312,'Input Calculation'!A12,\"\")","v":""},null,null,"Total:",{"$f":"VLOOKUP(VALUE($B$8),'Input Calculation'!$A$2:$AJ$29,36)","v":194.72},"Notes: ","Tried to place incantation on phone representative"]
[{"$f":"IF('Input Calculation'!B13=8785546312,'Input Calculation'!A13,\"\")","v":""}]
[{"$f":"IF('Input Calculation'!B14=8785546312,'Input Calculation'!A14,\"\")","v":""},{"$f":"MID($A$7,LEN(B8)+1,4)","v":"1018"},{"$f":"IFERROR(VLOOKUP(VALUE($B$20),'Input Calculation'!$A$2:$AJ$29,9),\"\")","v":3055845},{"$f":"_xlfn.IFNA(VLOOKUP($C20,'Product Information'!$A$2:$C$31,2),\"\")","v":"Winter Jacket"},{"$f":"_xlfn.IFNA(VLOOKUP($C20,'Product Information'!$A$2:$C$31,3),\"\")","v":199.99}]
[{"$f":"IF('Input Calculation'!B15=8785546312,'Input Calculation'!A15,\"\")","v":""},null,{"$f":"IFERROR(VLOOKUP(VALUE($B$20),'Input Calculation'!$A$2:$AJ$29,11),\"\")","v":""},{"$f":"_xlfn.IFNA(VLOOKUP($C21,'Product Information'!$A$2:$C$31,2),\"\")","v":""},{"$f":"_xlfn.IFNA(VLOOKUP($C21,'Product Information'!$A$2:$C$31,3),\"\")","v":""}]
[{"$f":"IF('Input Calculation'!B16=8785546312,'Input Calculation'!A16,\"\")","v":""},null,{"$f":"IFERROR(VLOOKUP(VALUE($B$20),'Input Calculation'!$A$2:$AJ$29,13),\"\")","v":""},{"$f":"_xlfn.IFNA(VLOOKUP($C22,'Product Information'!$A$2:$C$31,2),\"\")","v":""},{"$f":"_xlfn.IFNA(VLOOKUP($C22,'Product Information'!$A$2:$C$31,3),\"\")","v":""}]
[{"$f":"IF('Input Calculation'!B17=8785546312,'Input Calculation'!A17,\"\")","v":""},null,{"$f":"IFERROR(VLOOKUP(VALUE($B$20),'Input Calculation'!$A$2:$AJ$29,15),\"\")","v":""},{"$f":"_xlfn.IFNA(VLOOKUP($C23,'Product Information'!$A$2:$C$31,2),\"\")","v":""},{"$f":"_xlfn.IFNA(VLOOKUP($C23,'Product Information'!$A$2:$C$31,3),\"\")","v":""}]
[{"$f":"IF('Input Calculation'!B18=8785546312,'Input Calculation'!A18,\"\")","v":""},null,{"$f":"IFERROR(VLOOKUP(VALUE($B$20),'Input Calculation'!$A$2:$AJ$29,17),\"\")","v":""},{"$f":"_xlfn.IFNA(VLOOKUP($C24,'Product Information'!$A$2:$C$31,2),\"\")","v":""},{"$f":"_xlfn.IFNA(VLOOKUP($C24,'Product Information'!$A$2:$C$31,3),\"\")","v":""}]
[{"$f":"IF('Input Calculation'!B19=8785546312,'Input Calculation'!A19,\"\")","v":1018},null,{"$f":"IFERROR(VLOOKUP(VALUE($B$20),'Input Calculation'!$A$2:$AJ$29,19),\"\")","v":""},{"$f":"_xlfn.IFNA(VLOOKUP($C25,'Product Information'!$A$2:$C$31,2),\"\")","v":""},{"$f":"_xlfn.IFNA(VLOOKUP($C25,'Product Information'!$A$2:$C$31,3),\"\")","v":""}]
[{"$f":"IF('Input Calculation'!B20=8785546312,'Input Calculation'!A20,\"\")","v":""},null,{"$f":"IFERROR(VLOOKUP(VALUE($B$20),'Input Calculation'!$A$2:$AJ$29,21),\"\")","v":""},{"$f":"_xlfn.IFNA(VLOOKUP($C26,'Product Information'!$A$2:$C$31,2),\"\")","v":""},{"$f":"_xlfn.IFNA(VLOOKUP($C26,'Product Information'!$A$2:$C$31,3),\"\")","v":""}]
[{"$f":"IF('Input Calculation'!B21=8785546312,'Input Calculation'!A21,\"\")","v":""},null,{"$f":"IFERROR(VLOOKUP(VALUE($B$20),'Input Calculation'!$A$2:$AJ$29,23),\"\")","v":""},{"$f":"_xlfn.IFNA(VLOOKUP($C27,'Product Information'!$A$2:$C$31,2),\"\")","v":""},{"$f":"_xlfn.IFNA(VLOOKUP($C27,'Product Information'!$A$2:$C$31,3),\"\")","v":""}]
[{"$f":"IF('Input Calculation'!B22=8785546312,'Input Calculation'!A22,\"\")","v":""},null,{"$f":"IFERROR(VLOOKUP(VALUE($B$20),'Input Calculation'!$A$2:$AJ$29,25),\"\")","v":""},{"$f":"_xlfn.IFNA(VLOOKUP($C28,'Product Information'!$A$2:$C$31,2),\"\")","v":""},{"$f":"_xlfn.IFNA(VLOOKUP($C28,'Product Information'!$A$2:$C$31,3),\"\")","v":""}]
[{"$f":"IF('Input Calculation'!B23=8785546312,'Input Calculation'!A23,\"\")","v":""},null,{"$f":"IFERROR(VLOOKUP(VALUE($B$20),'Input Calculation'!$A$2:$AJ$29,27),\"\")","v":""},{"$f":"_xlfn.IFNA(VLOOKUP($C29,'Product Information'!$A$2:$C$31,2),\"\")","v":""},{"$f":"_xlfn.IFNA(VLOOKUP($C29,'Product Information'!$A$2:$C$31,3),\"\")","v":""}]
[{"$f":"IF('Input Calculation'!B24=8785546312,'Input Calculation'!A24,\"\")","v":""},null,null,"Total:",{"$f":"IFERROR(VLOOKUP(VALUE($B$20),'Input Calculation'!$A$2:$AJ$29,36),\"\")","v":194.72},"Notes: ","Said he needs more winter jackets"]
[{"$f":"IF('Input Calculation'!B25=8785546312,'Input Calculation'!A25,\"\")","v":""}]
[{"$f":"IF('Input Calculation'!B26=8785546312,'Input Calculation'!A26,\"\")","v":""},{"$f":"MID($A$7,LEN(B8)+LEN(B20)+1,4)","v":"1026"},{"$f":"IFERROR(VLOOKUP(VALUE($B$32),'Input Calculation'!$A$2:$AJ$29,9),\"\")","v":3055845},{"$f":"_xlfn.IFNA(VLOOKUP($C32,'Product Information'!$A$2:$C$31,2),\"\")","v":"Winter Jacket"},{"$f":"_xlfn.IFNA(VLOOKUP($C32,'Product Information'!$A$2:$C$31,3),\"\")","v":199.99}]
[{"$f":"IF('Input Calculation'!B27=8785546312,'Input Calculation'!A27,\"\")","v":1026},null,{"$f":"IFERROR(VLOOKUP(VALUE($B$32),'Input Calculation'!$A$2:$AJ$29,11),\"\")","v":""},{"$f":"_xlfn.IFNA(VLOOKUP($C33,'Product Information'!$A$2:$C$31,2),\"\")","v":""},{"$f":"_xlfn.IFNA(VLOOKUP($C33,'Product Information'!$A$2:$C$31,3),\"\")","v":""}]
[{"$f":"IF('Input Calculation'!B28=8785546312,'Input Calculation'!A28,\"\")","v":""},null,{"$f":"IFERROR(VLOOKUP(VALUE($B$32),'Input Calculation'!$A$2:$AJ$29,13),\"\")","v":""},{"$f":"_xlfn.IFNA(VLOOKUP($C34,'Product Information'!$A$2:$C$31,2),\"\")","v":""},{"$f":"_xlfn.IFNA(VLOOKUP($C34,'Product Information'!$A$2:$C$31,3),\"\")","v":""}]
[{"$f":"IF('Input Calculation'!B29=8785546312,'Input Calculation'!A29,\"\")","v":""},null,{"$f":"IFERROR(VLOOKUP(VALUE($B$32),'Input Calculation'!$A$2:$AJ$29,15),\"\")","v":""},{"$f":"_xlfn.IFNA(VLOOKUP($C35,'Product Information'!$A$2:$C$31,2),\"\")","v":""},{"$f":"_xlfn.IFNA(VLOOKUP($C35,'Product Information'!$A$2:$C$31,3),\"\")","v":""}]
[{"$f":"IF('Input Calculation'!B30=8785546312,'Input Calculation'!A30,\"\")","v":""},null,{"$f":"IFERROR(VLOOKUP(VALUE($B$32),'Input Calculation'!$A$2:$AJ$29,17),\"\")","v":""},{"$f":"_xlfn.IFNA(VLOOKUP($C36,'Product Information'!$A$2:$C$31,2),\"\")","v":""},{"$f":"_xlfn.IFNA(VLOOKUP($C36,'Product Information'!$A$2:$C$31,3),\"\")","v":""}]
[null,null,{"$f":"IFERROR(VLOOKUP(VALUE($B$32),'Input Calculation'!$A$2:$AJ$29,19),\"\")","v":""},{"$f":"_xlfn.IFNA(VLOOKUP($C37,'Product Information'!$A$2:$C$31,2),\"\")","v":""},{"$f":"_xlfn.IFNA(VLOOKUP($C37,'Product Information'!$A$2:$C$31,3),\"\")","v":""}]
[null,null,{"$f":"IFERROR(VLOOKUP(VALUE($B$32),'Input Calculation'!$A$2:$AJ$29,21),\"\")","v":""},{"$f":"_xlfn.IFNA(VLOOKUP($C38,'Product Information'!$A$2:$C$31,2),\"\")","v":""},{"$f":"_xlfn.IFNA(VLOOKUP($C38,'Product Information'!$A$2:$C$31,3),\"\")","v":""}]
[null,null,{"$f":"IFERROR(VLOOKUP(VALUE($B$32),'Input Calculation'!$A$2:$AJ$29,23),\"\")","v":""},{"$f":"_xlfn.IFNA(VLOOKUP($C39,'Product Information'!$A$2:$C$31,2),\"\")","v":""},{"$f":"_xlfn.IFNA(VLOOKUP($C39,'Product Information'!$A$2:$C$31,3),\"\")","v":""}]
[null,null,{"$f":"IFERROR(VLOOKUP(VALUE($B$32),'Input Calculation'!$A$2:$AJ$29,25),\"\")","v":""},{"$f":"_xlfn.IFNA(VLOOKUP($C40,'Product Information'!$A$2:$C$31,2),\"\")","v":""},{"$f":"_xlfn.IFNA(VLOOKUP($C40,'Product Information'!$A$2:$C$31,3),\"\")","v":""}]
[null,null,{"$f":"IFERROR(VLOOKUP(VALUE($B$32),'Input Calculation'!$A$2:$AJ$29,27),\"\")","v":""},{"$f":"_xlfn.IFNA(VLOOKUP($C41,'Product Information'!$A$2:$C$31,2),\"\")","v":""},{"$f":"_xlfn.IFNA(VLOOKUP($C41,'Product Information'!$A$2:$C$31,3),\"\")","v":""}]
[null,null,null,"Total:",{"$f":"IFERROR(VLOOKUP(VALUE($B$32),'Input Calculation'!$A$2:$AJ$29,36),\"\")","v":221.34},"Notes: ","He yelled \"I am a pumpkin!\" repeatedly"]
[]
[null,{"$f":"MID($A$7,LEN(B8)+LEN(B20)+LEN(B32)+1,4)","v":""},{"$f":"IFERROR(VLOOKUP(VALUE($B$44),'Input Calculation'!$A$2:$AJ$29,9),\"\")","v":""},{"$f":"_xlfn.IFNA(VLOOKUP($C44,'Product Information'!$A$2:$C$31,2),\"\")","v":""},{"$f":"_xlfn.IFNA(VLOOKUP($C44,'Product Information'!$A$2:$C$31,3),\"\")","v":""}]
[null,null,{"$f":"IFERROR(VLOOKUP(VALUE($B$44),'Input Calculation'!$A$2:$AJ$29,11),\"\")","v":""},{"$f":"_xlfn.IFNA(VLOOKUP($C45,'Product Information'!$A$2:$C$31,2),\"\")","v":""},{"$f":"_xlfn.IFNA(VLOOKUP($C45,'Product Information'!$A$2:$C$31,3),\"\")","v":""}]
[null,null,{"$f":"IFERROR(VLOOKUP(VALUE($B$44),'Input Calculation'!$A$2:$AJ$29,13),\"\")","v":""},{"$f":"_xlfn.IFNA(VLOOKUP($C46,'Product Information'!$A$2:$C$31,2),\"\")","v":""},{"$f":"_xlfn.IFNA(VLOOKUP($C46,'Product Information'!$A$2:$C$31,3),\"\")","v":""}]
[null,null,{"$f":"IFERROR(VLOOKUP(VALUE($B$44),'Input Calculation'!$A$2:$AJ$29,15),\"\")","v":""},{"$f":"_xlfn.IFNA(VLOOKUP($C47,'Product Information'!$A$2:$C$31,2),\"\")","v":""},{"$f":"_xlfn.IFNA(VLOOKUP($C47,'Product Information'!$A$2:$C$31,3),\"\")","v":""}]
[null,null,{"$f":"IFERROR(VLOOKUP(VALUE($B$44),'Input Calculation'!$A$2:$AJ$29,17),\"\")","v":""},{"$f":"_xlfn.IFNA(VLOOKUP($C48,'Product Information'!$A$2:$C$31,2),\"\")","v":""},{"$f":"_xlfn.IFNA(VLOOKUP($C48,'Product Information'!$A$2:$C$31,3),\"\")","v":""}]
[null,null,{"$f":"IFERROR(VLOOKUP(VALUE($B$44),'Input Calculation'!$A$2:$AJ$29,19),\"\")","v":""},{"$f":"_xlfn.IFNA(VLOOKUP($C49,'Product Information'!$A$2:$C$31,2),\"\")","v":""},{"$f":"_xlfn.IFNA(VLOOKUP($C49,'Product Information'!$A$2:$C$31,3),\"\")","v":""}]
[null,null,{"$f":"IFERROR(VLOOKUP(VALUE($B$44),'Input Calculation'!$A$2:$AJ$29,21),\"\")","v":""},{"$f":"_xlfn.IFNA(VLOOKUP($C50,'Product Information'!$A$2:$C$31,2),\"\")","v":""},{"$f":"_xlfn.IFNA(VLOOKUP($C50,'Product Information'!$A$2:$C$31,3),\"\")","v":""}]
[null,null,{"$f":"IFERROR(VLOOKUP(VALUE($B$44),'Input Calculation'!$A$2:$AJ$29,23),\"\")","v":""},{"$f":"_xlfn.IFNA(VLOOKUP($C51,'Product Information'!$A$2:$C$31,2),\"\")","v":""},{"$f":"_xlfn.IFNA(VLOOKUP($C51,'Product Information'!$A$2:$C$31,3),\"\")","v":""}]
[null,null,{"$f":"IFERROR(VLOOKUP(VALUE($B$44),'Input Calculation'!$A$2:$AJ$29,25),\"\")","v":""},{"$f":"_xlfn.IFNA(VLOOKUP($C52,'Product Information'!$A$2:$C$31,2),\"\")","v":""},{"$f":"_xlfn.IFNA(VLOOKUP($C52,'Product Information'!$A$2:$C$31,3),\"\")","v":""}]
[null,null,{"$f":"IFERROR(VLOOKUP(VALUE($B$44),'Input Calculation'!$A$2:$AJ$29,27),\"\")","v":""},{"$f":"_xlfn.IFNA(VLOOKUP($C53,'Product Information'!$A$2:$C$31,2),\"\")","v":""},{"$f":"_xlfn.IFNA(VLOOKUP($C53,'Product Information'!$A$2:$C$31,3),\"\")","v":""}]
[null,null,null,"Total:",{"$f":"IFERROR(VLOOKUP(VALUE($B$44),'Input Calculation'!$A$2:$AJ$29,36),\"\")","v":""},"Notes: "]
[]
[null,{"$f":"MID($A$7,LEN(B8)+LEN(B20)+LEN(B32)+LEN(B44)+1,4)","v":""},{"$f":"IFERROR(VLOOKUP(VALUE($B$56),'Input Calculation'!$A$2:$AJ$29,9),\"\")","v":""},{"$f":"_xlfn.IFNA(VLOOKUP($C56,'Product Information'!$A$2:$C$31,2),\"\")","v":""},{"$f":"_xlfn.IFNA(VLOOKUP($C56,'Product Information'!$A$2:$C$31,3),\"\")","v":""}]
[null,null,{"$f":"IFERROR(VLOOKUP(VALUE($B$56),'Input Calculation'!$A$2:$AJ$29,11),\"\")","v":""},{"$f":"_xlfn.IFNA(VLOOKUP($C57,'Product Information'!$A$2:$C$31,2),\"\")","v":""},{"$f":"_xlfn.IFNA(VLOOKUP($C57,'Product Information'!$A$2:$C$31,3),\"\")","v":""}]
[null,null,{"$f":"IFERROR(VLOOKUP(VALUE($B$56),'Input Calculation'!$A$2:$AJ$29,13),\"\")","v":""},{"$f":"_xlfn.IFNA(VLOOKUP($C58,'Product Information'!$A$2:$C$31,2),\"\")","v":""},{"$f":"_xlfn.IFNA(VLOOKUP($C58,'Product Information'!$A$2:$C$31,3),\"\")","v":""}]
[null,null,{"$f":"IFERROR(VLOOKUP(VALUE($B$56),'Input Calculation'!$A$2:$AJ$29,15),\"\")","v":""},{"$f":"_xlfn.IFNA(VLOOKUP($C59,'Product Information'!$A$2:$C$31,2),\"\")","v":""},{"$f":"_xlfn.IFNA(VLOOKUP($C59,'Product Information'!$A$2:$C$31,3),\"\")","v":""}]
[null,null,{"$f":"IFERROR(VLOOKUP(VALUE($B$56),'Input Calculation'!$A$2:$AJ$29,17),\"\")","v":""},{"$f":"_xlfn.IFNA(VLOOKUP($C60,'Product Information'!$A$2:$C$31,2),\"\")","v":""},{"$f":"_xlfn.IFNA(VLOOKUP($C60,'Product Information'!$A$2:$C$31,3),\"\")","v":""}]
[null,null,{"$f":"IFERROR(VLOOKUP(VALUE($B$56),'Input Calculation'!$A$2:$AJ$29,19),\"\")","v":""},{"$f":"_xlfn.IFNA(VLOOKUP($C61,'Product Information'!$A$2:$C$31,2),\"\")","v":""},{"$f":"_xlfn.IFNA(VLOOKUP($C61,'Product Information'!$A$2:$C$31,3),\"\")","v":""}]
[null,null,{"$f":"IFERROR(VLOOKUP(VALUE($B$56),'Input Calculation'!$A$2:$AJ$29,21),\"\")","v":""},{"$f":"_xlfn.IFNA(VLOOKUP($C62,'Product Information'!$A$2:$C$31,2),\"\")","v":""},{"$f":"_xlfn.IFNA(VLOOKUP($C62,'Product Information'!$A$2:$C$31,3),\"\")","v":""}]
[null,null,{"$f":"IFERROR(VLOOKUP(VALUE($B$56),'Input Calculation'!$A$2:$AJ$29,23),\"\")","v":""},{"$f":"_xlfn.IFNA(VLOOKUP($C63,'Product Information'!$A$2:$C$31,2),\"\")","v":""},{"$f":"_xlfn.IFNA(VLOOKUP($C63,'Product Information'!$A$2:$C$31,3),\"\")","v":""}]
[null,null,{"$f":"IFERROR(VLOOKUP(VALUE($B$56),'Input Calculation'!$A$2:$AJ$29,25),\"\")","v":""},{"$f":"_xlfn.IFNA(VLOOKUP($C64,'Product Information'!$A$2:$C$31,2),\"\")","v":""},{"$f":"_xlfn.IFNA(VLOOKUP($C64,'Product Information'!$A$2:$C$31,3),\"\")","v":""}]
[null,null,{"$f":"IFERROR(VLOOKUP(VALUE($B$56),'Input Calculation'!$A$2:$AJ$29,27),\"\")","v":""},{"$f":"_xlfn.IFNA(VLOOKUP($C65,'Product Information'!$A$2:$C$31,2),\"\")","v":""},{"$f":"_xlfn.IFNA(VLOOKUP($C65,'Product Information'!$A$2:$C$31,3),\"\")","v":""}]
[null,null,null,"Total:",{"$f":"IFERROR(VLOOKUP(VALUE($B$56),'Input Calculation'!$A$2:$AJ$29,36),\"\")","v":""},"Notes: "]
[]
[null,{"$f":"MID($A$7,LEN(B8)+LEN(B20)+LEN(B32)+LEN(B44)+LEN(B56)+1,4)","v":""},{"$f":"IFERROR(VLOOKUP(VALUE($B$68),'Input Calculation'!$A$2:$AJ$29,9),\"\")","v":""},{"$f":"_xlfn.IFNA(VLOOKUP($C68,'Product Information'!$A$2:$C$31,2),\"\")","v":""},{"$f":"_xlfn.IFNA(VLOOKUP($C68,'Product Information'!$A$2:$C$31,3),\"\")","v":""}]
[null,null,{"$f":"IFERROR(VLOOKUP(VALUE($B$68),'Input Calculation'!$A$2:$AJ$29,11),\"\")","v":""},{"$f":"_xlfn.IFNA(VLOOKUP($C69,'Product Information'!$A$2:$C$31,2),\"\")","v":""},{"$f":"_xlfn.IFNA(VLOOKUP($C69,'Product Information'!$A$2:$C$31,3),\"\")","v":""}]
[null,null,{"$f":"IFERROR(VLOOKUP(VALUE($B$68),'Input Calculation'!$A$2:$AJ$29,13),\"\")","v":""},{"$f":"_xlfn.IFNA(VLOOKUP($C70,'Product Information'!$A$2:$C$31,2),\"\")","v":""},{"$f":"_xlfn.IFNA(VLOOKUP($C70,'Product Information'!$A$2:$C$31,3),\"\")","v":""}]
[null,null,{"$f":"IFERROR(VLOOKUP(VALUE($B$68),'Input Calculation'!$A$2:$AJ$29,15),\"\")","v":""},{"$f":"_xlfn.IFNA(VLOOKUP($C71,'Product Information'!$A$2:$C$31,2),\"\")","v":""},{"$f":"_xlfn.IFNA(VLOOKUP($C71,'Product Information'!$A$2:$C$31,3),\"\")","v":""}]
[null,null,{"$f":"IFERROR(VLOOKUP(VALUE($B$68),'Input Calculation'!$A$2:$AJ$29,17),\"\")","v":""},{"$f":"_xlfn.IFNA(VLOOKUP($C72,'Product Information'!$A$2:$C$31,2),\"\")","v":""},{"$f":"_xlfn.IFNA(VLOOKUP($C72,'Product Information'!$A$2:$C$31,3),\"\")","v":""}]
[null,null,{"$f":"IFERROR(VLOOKUP(VALUE($B$68),'Input Calculation'!$A$2:$AJ$29,19),\"\")","v":""},{"$f":"_xlfn.IFNA(VLOOKUP($C73,'Product Information'!$A$2:$C$31,2),\"\")","v":""},{"$f":"_xlfn.IFNA(VLOOKUP($C73,'Product Information'!$A$2:$C$31,3),\"\")","v":""}]
[null,null,{"$f":"IFERROR(VLOOKUP(VALUE($B$68),'Input Calculation'!$A$2:$AJ$29,21),\"\")","v":""},{"$f":"_xlfn.IFNA(VLOOKUP($C74,'Product Information'!$A$2:$C$31,2),\"\")","v":""},{"$f":"_xlfn.IFNA(VLOOKUP($C74,'Product Information'!$A$2:$C$31,3),\"\")","v":""}]
[null,null,{"$f":"IFERROR(VLOOKUP(VALUE($B$68),'Input Calculation'!$A$2:$AJ$29,23),\"\")","v":""},{"$f":"_xlfn.IFNA(VLOOKUP($C75,'Product Information'!$A$2:$C$31,2),\"\")","v":""},{"$f":"_xlfn.IFNA(VLOOKUP($C75,'Product Information'!$A$2:$C$31,3),\"\")","v":""}]
[null,null,{"$f":"IFERROR(VLOOKUP(VALUE($B$68),'Input Calculation'!$A$2:$AJ$29,25),\"\")","v":""},{"$f":"_xlfn.IFNA(VLOOKUP($C76,'Product Information'!$A$2:$C$31,2),\"\")","v":""},{"$f":"_xlfn.IFNA(VLOOKUP($C76,'Product Information'!$A$2:$C$31,3),\"\")","v":""}]
[null,null,{"$f":"IFERROR(VLOOKUP(VALUE($B$68),'Input Calculation'!$A$2:$AJ$29,27),\"\")","v":""},{"$f":"_xlfn.IFNA(VLOOKUP($C77,'Product Information'!$A$2:$C$31,2),\"\")","v":""},{"$f":"_xlfn.IFNA(VLOOKUP($C77,'Product Information'!$A$2:$C$31,3),\"\")","v":""}]
[null,null,null,"Total:",{"$f":"IFERROR(VLOOKUP(VALUE($B$68),'Input Calculation'!$A$2:$AJ$29,36),\"\")","v":""},"Notes: "]

{"sheet":"9153230352","index":16,"n_rows":78,"n_cols":6,"rows_kept":78,"cut":false,"hidden":true,"merged":[]}
["Name:",{"$f":"VLOOKUP(9153230352,'Customer Information'!$A$2:$I$12,2)","v":"Liberace Mister"}]
["Phone:",{"$f":"TEXT(9153230352,\"###-###-####\")","v":"915-323-0352"}]
["Email:",{"$f":"VLOOKUP(9153230352,'Customer Information'!$A$2:$I$12,3)","v":"Piano12@yahoo.com"}]
["Address:",{"$f":"CONCATENATE(VLOOKUP(9153230352,'Customer Information'!$A$2:$I$12,4),\", \",VLOOKUP(9153230352,'Customer Information'!$A$2:$I$12,5),\", \",VLOOKUP(9153230352,'Customer Information'!$A$2:$I$12,6),\" \",VLOOKUP(9153230352,'Customer Information'!$A$2:$I$12,7))","v":"432 Flamingo Drive, Las Vegas, NV 73547"}]
["Customer Since:",{"$f":"VLOOKUP(9153230352,'Customer Information'!$A$2:$I$12,8)","v":1985}]
["Good Standing:",{"$f":"VLOOKUP(9153230352,'Customer Information'!$A$2:$I$12,9)","v":"Yes"}]
[{"$f":"CONCATENATE(A8,A9,A10,A11,A12,A13,A14,A15,A16,A17,A18,A19,A20,A21,A22,A23,A24,A25,A26,A27,A28,A29,A30,A31,A32,A33,A34,A35,A36)","v":"1024"},"Order Number"]
[{"$f":"IF('Input Calculation'!B2=9153230352,'Input Calculation'!A2,\"\")","v":""},{"$f":"MID($A$7,ROW()-7,4)","v":"1024"},{"$f":"IFERROR(VLOOKUP(VALUE($B$8),'Input Calculation'!$A$2:$AJ$29,9),\"\")","v":1252953},{"$f":"_xlfn.IFNA(VLOOKUP($C8,'Product Information'!$A$2:$C$31,2),\"\")","v":"Great Shirt"},{"$f":"_xlfn.IFNA(VLOOKUP($C8,'Product Information'!$A$2:$C$31,3),\"\")","v":54.99}]
[{"$f":"IF('Input Calculation'!B3=9153230352,'Input Calculation'!A3,\"\")","v":""},null,{"$f":"IFERROR(VLOOKUP(VALUE($B$8),'Input Calculation'!$A$2:$AJ$29,11),\"\")","v":1465559},{"$f":"_xlfn.IFNA(VLOOKUP($C9,'Product Information'!$A$2:$C$31,2),\"\")","v":"Pants"},{"$f":"_xlfn.IFNA(VLOOKUP($C9,'Product Information'!$A$2:$C$31,3),\"\")","v":24.99}]
[{"$f":"IF('Input Calculation'!B4=9153230352,'Input Calculation'!A4,\"\")","v":""},null,{"$f":"IFERROR(VLOOKUP(VALUE($B$8),'Input Calculation'!$A$2:$AJ$29,13),\"\")","v":1983220},{"$f":"_xlfn.IFNA(VLOOKUP($C10,'Product Information'!$A$2:$C$31,2),\"\")","v":"Nicer Pants"},{"$f":"_xlfn.IFNA(VLOOKUP($C10,'Product Information'!$A$2:$C$31,3),\"\")","v":34.99}]
[{"$f":"IF('Input Calculation'!B5=9153230352,'Input Calculation'!A5,\"\")","v":""},null,{"$f":"IFERROR(VLOOKUP(VALUE($B$8),'Input Calculation'!$A$2:$AJ$29,15),\"\")","v":2056772},{"$f":"_xlfn.IFNA(VLOOKUP($C11,'Product Information'!$A$2:$C$31,2),\"\")","v":"Great Pants"},{"$f":"_xlfn.IFNA(VLOOKUP($C11,'Product Information'!$A$2:$C$31,3),\"\")","v":74.989999999999995}]
[{"$f":"IF('Input Calculation'!B6=9153230352,'Input Calculation'!A6,\"\")","v":""},null,{"$f":"IFERROR(VLOOKUP(VALUE($B$8),'Input Calculation'!$A$2:$AJ$29,17),\"\")","v":2847693},{"$f":"_xlfn.IFNA(VLOOKUP($C12,'Product Information'!$A$2:$C$31,2),\"\")","v":"Jacket"},{"$f":"_xlfn.IFNA(VLOOKUP($C12,'Product Information'!$A$2:$C$31,3),\"\")","v":134.99}]
[{"$f":"IF('Input Calculation'!B7=9153230352,'Input Calculation'!A7,\"\")","v":""},null,{"$f":"IFERROR(VLOOKUP(VALUE($B$8),'Input Calculation'!$A$2:$AJ$29,19),\"\")","v":3055845},{"$f":"_xlfn.IFNA(VLOOKUP($C13,'Product Information'!$A$2:$C$31,2),\"\")","v":"Winter Jacket"},{"$f":"_xlfn.IFNA(VLOOKUP($C13,'Product Information'!$A$2:$C$31,3),\"\")","v":199.99}]
[{"$f":"IF('Input Calculation'!B8=9153230352,'Input Calculation'!A8,\"\")","v":""},null,{"$f":"IFERROR(VLOOKUP(VALUE($B$8),'Input Calculation'!$A$2:$AJ$29,21),\"\")","v":3148653},{"$f":"_xlfn.IFNA(VLOOKUP($C14,'Product Information'!$A$2:$C$31,2),\"\")","v":"Leather Jacket"},{"$f":"_xlfn.IFNA(VLOOKUP($C14,'Product Information'!$A$2:$C$31,3),\"\")","v":449.99}]
[{"$f":"IF('Input Calculation'!B9=9153230352,'Input Calculation'!A9,\"\")","v":""},null,{"$f":"IFERROR(VLOOKUP(VALUE($B$8),'Input Calculation'!$A$2:$AJ$29,23),\"\")","v":3785616},{"$f":"_xlfn.IFNA(VLOOKUP($C15,'Product Information'!$A$2:$C$31,2),\"\")","v":"Dressy Jacket"},{"$f":"_xlfn.IFNA(VLOOKUP($C15,'Product Information'!$A$2:$C$31,3),\"\")","v":499.99}]
[{"$f":"IF('Input Calculation'!B10=9153230352,'Input Calculation'!A10,\"\")","v":""},null,{"$f":"IFERROR(VLOOKUP(VALUE($B$8),'Input Calculation'!$A$2:$AJ$29,25),\"\")","v":3818725},{"$f":"_xlfn.IFNA(VLOOKUP($C16,'Product Information'!$A$2:$C$31,2),\"\")","v":"Logo Jacket"},{"$f":"_xlfn.IFNA(VLOOKUP($C16,'Product Information'!$A$2:$C$31,3),\"\")","v":999.99}]
[{"$f":"IF('Input Calculation'!B11=9153230352,'Input Calculation'!A11,\"\")","v":""},null,{"$f":"IFERROR(VLOOKUP(VALUE($B$8),'Input Calculation'!$A$2:$AJ$29,27),\"\")","v":3832255},{"$f":"_xlfn.IFNA(VLOOKUP($C17,'Product Information'!$A$2:$C$31,2),\"\")","v":"Hat"},{"$f":"_xlfn.IFNA(VLOOKUP($C17,'Product Information'!$A$2:$C$31,3),\"\")","v":19.989999999999998}]
[{"$f":"IF('Input Calculation'!B12=9153230352,'Input Calculation'!A12,\"\")","v":""},null,null,"Total:",{"$f":"VLOOKUP(VALUE($B$8),'Input Calculation'!$A$2:$AJ$29,36)","v":2432.2199999999998},"Notes: "]
[{"$f":"IF('Input Calculation'!B13=9153230352,'Input Calculation'!A13,\"\")","v":""}]
[{"$f":"IF('Input Calculation'!B14=9153230352,'Input Calculation'!A14,\"\")","v":""},{"$f":"MID($A$7,LEN(B8)+1,4)","v":""},{"$f":"IFERROR(VLOOKUP(VALUE($B$20),'Input Calculation'!$A$2:$AJ$29,9),\"\")","v":""},{"$f":"_xlfn.IFNA(VLOOKUP($C20,'Product Information'!$A$2:$C$31,2),\"\")","v":""},{"$f":"_xlfn.IFNA(VLOOKUP($C20,'Product Information'!$A$2:$C$31,3),\"\")","v":""}]
[{"$f":"IF('Input Calculation'!B15=9153230352,'Input Calculation'!A15,\"\")","v":""},null,{"$f":"IFERROR(VLOOKUP(VALUE($B$20),'Input Calculation'!$A$2:$AJ$29,11),\"\")","v":""},{"$f":"_xlfn.IFNA(VLOOKUP($C21,'Product Information'!$A$2:$C$31,2),\"\")","v":""},{"$f":"_xlfn.IFNA(VLOOKUP($C21,'Product Information'!$A$2:$C$31,3),\"\")","v":""}]
[{"$f":"IF('Input Calculation'!B16=9153230352,'Input Calculation'!A16,\"\")","v":""},null,{"$f":"IFERROR(VLOOKUP(VALUE($B$20),'Input Calculation'!$A$2:$AJ$29,13),\"\")","v":""},{"$f":"_xlfn.IFNA(VLOOKUP($C22,'Product Information'!$A$2:$C$31,2),\"\")","v":""},{"$f":"_xlfn.IFNA(VLOOKUP($C22,'Product Information'!$A$2:$C$31,3),\"\")","v":""}]
[{"$f":"IF('Input Calculation'!B17=9153230352,'Input Calculation'!A17,\"\")","v":""},null,{"$f":"IFERROR(VLOOKUP(VALUE($B$20),'Input Calculation'!$A$2:$AJ$29,15),\"\")","v":""},{"$f":"_xlfn.IFNA(VLOOKUP($C23,'Product Information'!$A$2:$C$31,2),\"\")","v":""},{"$f":"_xlfn.IFNA(VLOOKUP($C23,'Product Information'!$A$2:$C$31,3),\"\")","v":""}]
[{"$f":"IF('Input Calculation'!B18=9153230352,'Input Calculation'!A18,\"\")","v":""},null,{"$f":"IFERROR(VLOOKUP(VALUE($B$20),'Input Calculation'!$A$2:$AJ$29,17),\"\")","v":""},{"$f":"_xlfn.IFNA(VLOOKUP($C24,'Product Information'!$A$2:$C$31,2),\"\")","v":""},{"$f":"_xlfn.IFNA(VLOOKUP($C24,'Product Information'!$A$2:$C$31,3),\"\")","v":""}]
[{"$f":"IF('Input Calculation'!B19=9153230352,'Input Calculation'!A19,\"\")","v":""},null,{"$f":"IFERROR(VLOOKUP(VALUE($B$20),'Input Calculation'!$A$2:$AJ$29,19),\"\")","v":""},{"$f":"_xlfn.IFNA(VLOOKUP($C25,'Product Information'!$A$2:$C$31,2),\"\")","v":""},{"$f":"_xlfn.IFNA(VLOOKUP($C25,'Product Information'!$A$2:$C$31,3),\"\")","v":""}]
[{"$f":"IF('Input Calculation'!B20=9153230352,'Input Calculation'!A20,\"\")","v":""},null,{"$f":"IFERROR(VLOOKUP(VALUE($B$20),'Input Calculation'!$A$2:$AJ$29,21),\"\")","v":""},{"$f":"_xlfn.IFNA(VLOOKUP($C26,'Product Information'!$A$2:$C$31,2),\"\")","v":""},{"$f":"_xlfn.IFNA(VLOOKUP($C26,'Product Information'!$A$2:$C$31,3),\"\")","v":""}]
[{"$f":"IF('Input Calculation'!B21=9153230352,'Input Calculation'!A21,\"\")","v":""},null,{"$f":"IFERROR(VLOOKUP(VALUE($B$20),'Input Calculation'!$A$2:$AJ$29,23),\"\")","v":""},{"$f":"_xlfn.IFNA(VLOOKUP($C27,'Product Information'!$A$2:$C$31,2),\"\")","v":""},{"$f":"_xlfn.IFNA(VLOOKUP($C27,'Product Information'!$A$2:$C$31,3),\"\")","v":""}]
[{"$f":"IF('Input Calculation'!B22=9153230352,'Input Calculation'!A22,\"\")","v":""},null,{"$f":"IFERROR(VLOOKUP(VALUE($B$20),'Input Calculation'!$A$2:$AJ$29,25),\"\")","v":""},{"$f":"_xlfn.IFNA(VLOOKUP($C28,'Product Information'!$A$2:$C$31,2),\"\")","v":""},{"$f":"_xlfn.IFNA(VLOOKUP($C28,'Product Information'!$A$2:$C$31,3),\"\")","v":""}]
[{"$f":"IF('Input Calculation'!B23=9153230352,'Input Calculation'!A23,\"\")","v":""},null,{"$f":"IFERROR(VLOOKUP(VALUE($B$20),'Input Calculation'!$A$2:$AJ$29,27),\"\")","v":""},{"$f":"_xlfn.IFNA(VLOOKUP($C29,'Product Information'!$A$2:$C$31,2),\"\")","v":""},{"$f":"_xlfn.IFNA(VLOOKUP($C29,'Product Information'!$A$2:$C$31,3),\"\")","v":""}]
[{"$f":"IF('Input Calculation'!B24=9153230352,'Input Calculation'!A24,\"\")","v":""},null,null,"Total:",{"$f":"IFERROR(VLOOKUP(VALUE($B$20),'Input Calculation'!$A$2:$AJ$29,36),\"\")","v":""},"Notes: "]
[{"$f":"IF('Input Calculation'!B25=9153230352,'Input Calculation'!A25,\"\")","v":1024}]
[{"$f":"IF('Input Calculation'!B26=9153230352,'Input Calculation'!A26,\"\")","v":""},{"$f":"MID($A$7,LEN(B8)+LEN(B20)+1,4)","v":""},{"$f":"IFERROR(VLOOKUP(VALUE($B$32),'Input Calculation'!$A$2:$AJ$29,9),\"\")","v":""},{"$f":"_xlfn.IFNA(VLOOKUP($C32,'Product Information'!$A$2:$C$31,2),\"\")","v":""},{"$f":"_xlfn.IFNA(VLOOKUP($C32,'Product Information'!$A$2:$C$31,3),\"\")","v":""}]
[{"$f":"IF('Input Calculation'!B27=9153230352,'Input Calculation'!A27,\"\")","v":""},null,{"$f":"IFERROR(VLOOKUP(VALUE($B$32),'Input Calculation'!$A$2:$AJ$29,11),\"\")","v":""},{"$f":"_xlfn.IFNA(VLOOKUP($C33,'Product Information'!$A$2:$C$31,2),\"\")","v":""},{"$f":"_xlfn.IFNA(VLOOKUP($C33,'Product Information'!$A$2:$C$31,3),\"\")","v":""}]
[{"$f":"IF('Input Calculation'!B28=9153230352,'Input Calculation'!A28,\"\")","v":""},null,{"$f":"IFERROR(VLOOKUP(VALUE($B$32),'Input Calculation'!$A$2:$AJ$29,13),\"\")","v":""},{"$f":"_xlfn.IFNA(VLOOKUP($C34,'Product Information'!$A$2:$C$31,2),\"\")","v":""},{"$f":"_xlfn.IFNA(VLOOKUP($C34,'Product Information'!$A$2:$C$31,3),\"\")","v":""}]
[{"$f":"IF('Input Calculation'!B29=9153230352,'Input Calculation'!A29,\"\")","v":""},null,{"$f":"IFERROR(VLOOKUP(VALUE($B$32),'Input Calculation'!$A$2:$AJ$29,15),\"\")","v":""},{"$f":"_xlfn.IFNA(VLOOKUP($C35,'Product Information'!$A$2:$C$31,2),\"\")","v":""},{"$f":"_xlfn.IFNA(VLOOKUP($C35,'Product Information'!$A$2:$C$31,3),\"\")","v":""}]
[{"$f":"IF('Input Calculation'!B30=9153230352,'Input Calculation'!A30,\"\")","v":""},null,{"$f":"IFERROR(VLOOKUP(VALUE($B$32),'Input Calculation'!$A$2:$AJ$29,17),\"\")","v":""},{"$f":"_xlfn.IFNA(VLOOKUP($C36,'Product Information'!$A$2:$C$31,2),\"\")","v":""},{"$f":"_xlfn.IFNA(VLOOKUP($C36,'Product Information'!$A$2:$C$31,3),\"\")","v":""}]
[null,null,{"$f":"IFERROR(VLOOKUP(VALUE($B$32),'Input Calculation'!$A$2:$AJ$29,19),\"\")","v":""},{"$f":"_xlfn.IFNA(VLOOKUP($C37,'Product Information'!$A$2:$C$31,2),\"\")","v":""},{"$f":"_xlfn.IFNA(VLOOKUP($C37,'Product Information'!$A$2:$C$31,3),\"\")","v":""}]
[null,null,{"$f":"IFERROR(VLOOKUP(VALUE($B$32),'Input Calculation'!$A$2:$AJ$29,21),\"\")","v":""},{"$f":"_xlfn.IFNA(VLOOKUP($C38,'Product Information'!$A$2:$C$31,2),\"\")","v":""},{"$f":"_xlfn.IFNA(VLOOKUP($C38,'Product Information'!$A$2:$C$31,3),\"\")","v":""}]
[null,null,{"$f":"IFERROR(VLOOKUP(VALUE($B$32),'Input Calculation'!$A$2:$AJ$29,23),\"\")","v":""},{"$f":"_xlfn.IFNA(VLOOKUP($C39,'Product Information'!$A$2:$C$31,2),\"\")","v":""},{"$f":"_xlfn.IFNA(VLOOKUP($C39,'Product Information'!$A$2:$C$31,3),\"\")","v":""}]
[null,null,{"$f":"IFERROR(VLOOKUP(VALUE($B$32),'Input Calculation'!$A$2:$AJ$29,25),\"\")","v":""},{"$f":"_xlfn.IFNA(VLOOKUP($C40,'Product Information'!$A$2:$C$31,2),\"\")","v":""},{"$f":"_xlfn.IFNA(VLOOKUP($C40,'Product Information'!$A$2:$C$31,3),\"\")","v":""}]
[null,null,{"$f":"IFERROR(VLOOKUP(VALUE($B$32),'Input Calculation'!$A$2:$AJ$29,27),\"\")","v":""},{"$f":"_xlfn.IFNA(VLOOKUP($C41,'Product Information'!$A$2:$C$31,2),\"\")","v":""},{"$f":"_xlfn.IFNA(VLOOKUP($C41,'Product Information'!$A$2:$C$31,3),\"\")","v":""}]
[null,null,null,"Total:",{"$f":"IFERROR(VLOOKUP(VALUE($B$32),'Input Calculation'!$A$2:$AJ$29,36),\"\")","v":""},"Notes: "]
[]
[null,{"$f":"MID($A$7,LEN(B8)+LEN(B20)+LEN(B32)+1,4)","v":""},{"$f":"IFERROR(VLOOKUP(VALUE($B$44),'Input Calculation'!$A$2:$AJ$29,9),\"\")","v":""},{"$f":"_xlfn.IFNA(VLOOKUP($C44,'Product Information'!$A$2:$C$31,2),\"\")","v":""},{"$f":"_xlfn.IFNA(VLOOKUP($C44,'Product Information'!$A$2:$C$31,3),\"\")","v":""}]
[null,null,{"$f":"IFERROR(VLOOKUP(VALUE($B$44),'Input Calculation'!$A$2:$AJ$29,11),\"\")","v":""},{"$f":"_xlfn.IFNA(VLOOKUP($C45,'Product Information'!$A$2:$C$31,2),\"\")","v":""},{"$f":"_xlfn.IFNA(VLOOKUP($C45,'Product Information'!$A$2:$C$31,3),\"\")","v":""}]
[null,null,{"$f":"IFERROR(VLOOKUP(VALUE($B$44),'Input Calculation'!$A$2:$AJ$29,13),\"\")","v":""},{"$f":"_xlfn.IFNA(VLOOKUP($C46,'Product Information'!$A$2:$C$31,2),\"\")","v":""},{"$f":"_xlfn.IFNA(VLOOKUP($C46,'Product Information'!$A$2:$C$31,3),\"\")","v":""}]
[null,null,{"$f":"IFERROR(VLOOKUP(VALUE($B$44),'Input Calculation'!$A$2:$AJ$29,15),\"\")","v":""},{"$f":"_xlfn.IFNA(VLOOKUP($C47,'Product Information'!$A$2:$C$31,2),\"\")","v":""},{"$f":"_xlfn.IFNA(VLOOKUP($C47,'Product Information'!$A$2:$C$31,3),\"\")","v":""}]
[null,null,{"$f":"IFERROR(VLOOKUP(VALUE($B$44),'Input Calculation'!$A$2:$AJ$29,17),\"\")","v":""},{"$f":"_xlfn.IFNA(VLOOKUP($C48,'Product Information'!$A$2:$C$31,2),\"\")","v":""},{"$f":"_xlfn.IFNA(VLOOKUP($C48,'Product Information'!$A$2:$C$31,3),\"\")","v":""}]
[null,null,{"$f":"IFERROR(VLOOKUP(VALUE($B$44),'Input Calculation'!$A$2:$AJ$29,19),\"\")","v":""},{"$f":"_xlfn.IFNA(VLOOKUP($C49,'Product Information'!$A$2:$C$31,2),\"\")","v":""},{"$f":"_xlfn.IFNA(VLOOKUP($C49,'Product Information'!$A$2:$C$31,3),\"\")","v":""}]
[null,null,{"$f":"IFERROR(VLOOKUP(VALUE($B$44),'Input Calculation'!$A$2:$AJ$29,21),\"\")","v":""},{"$f":"_xlfn.IFNA(VLOOKUP($C50,'Product Information'!$A$2:$C$31,2),\"\")","v":""},{"$f":"_xlfn.IFNA(VLOOKUP($C50,'Product Information'!$A$2:$C$31,3),\"\")","v":""}]
[null,null,{"$f":"IFERROR(VLOOKUP(VALUE($B$44),'Input Calculation'!$A$2:$AJ$29,23),\"\")","v":""},{"$f":"_xlfn.IFNA(VLOOKUP($C51,'Product Information'!$A$2:$C$31,2),\"\")","v":""},{"$f":"_xlfn.IFNA(VLOOKUP($C51,'Product Information'!$A$2:$C$31,3),\"\")","v":""}]
[null,null,{"$f":"IFERROR(VLOOKUP(VALUE($B$44),'Input Calculation'!$A$2:$AJ$29,25),\"\")","v":""},{"$f":"_xlfn.IFNA(VLOOKUP($C52,'Product Information'!$A$2:$C$31,2),\"\")","v":""},{"$f":"_xlfn.IFNA(VLOOKUP($C52,'Product Information'!$A$2:$C$31,3),\"\")","v":""}]
[null,null,{"$f":"IFERROR(VLOOKUP(VALUE($B$44),'Input Calculation'!$A$2:$AJ$29,27),\"\")","v":""},{"$f":"_xlfn.IFNA(VLOOKUP($C53,'Product Information'!$A$2:$C$31,2),\"\")","v":""},{"$f":"_xlfn.IFNA(VLOOKUP($C53,'Product Information'!$A$2:$C$31,3),\"\")","v":""}]
[null,null,null,"Total:",{"$f":"IFERROR(VLOOKUP(VALUE($B$44),'Input Calculation'!$A$2:$AJ$29,36),\"\")","v":""},"Notes: "]
[]
[null,{"$f":"MID($A$7,LEN(B8)+LEN(B20)+LEN(B32)+LEN(B44)+1,4)","v":""},{"$f":"IFERROR(VLOOKUP(VALUE($B$56),'Input Calculation'!$A$2:$AJ$29,9),\"\")","v":""},{"$f":"_xlfn.IFNA(VLOOKUP($C56,'Product Information'!$A$2:$C$31,2),\"\")","v":""},{"$f":"_xlfn.IFNA(VLOOKUP($C56,'Product Information'!$A$2:$C$31,3),\"\")","v":""}]
[null,null,{"$f":"IFERROR(VLOOKUP(VALUE($B$56),'Input Calculation'!$A$2:$AJ$29,11),\"\")","v":""},{"$f":"_xlfn.IFNA(VLOOKUP($C57,'Product Information'!$A$2:$C$31,2),\"\")","v":""},{"$f":"_xlfn.IFNA(VLOOKUP($C57,'Product Information'!$A$2:$C$31,3),\"\")","v":""}]
[null,null,{"$f":"IFERROR(VLOOKUP(VALUE($B$56),'Input Calculation'!$A$2:$AJ$29,13),\"\")","v":""},{"$f":"_xlfn.IFNA(VLOOKUP($C58,'Product Information'!$A$2:$C$31,2),\"\")","v":""},{"$f":"_xlfn.IFNA(VLOOKUP($C58,'Product Information'!$A$2:$C$31,3),\"\")","v":""}]
[null,null,{"$f":"IFERROR(VLOOKUP(VALUE($B$56),'Input Calculation'!$A$2:$AJ$29,15),\"\")","v":""},{"$f":"_xlfn.IFNA(VLOOKUP($C59,'Product Information'!$A$2:$C$31,2),\"\")","v":""},{"$f":"_xlfn.IFNA(VLOOKUP($C59,'Product Information'!$A$2:$C$31,3),\"\")","v":""}]
[null,null,{"$f":"IFERROR(VLOOKUP(VALUE($B$56),'Input Calculation'!$A$2:$AJ$29,17),\"\")","v":""},{"$f":"_xlfn.IFNA(VLOOKUP($C60,'Product Information'!$A$2:$C$31,2),\"\")","v":""},{"$f":"_xlfn.IFNA(VLOOKUP($C60,'Product Information'!$A$2:$C$31,3),\"\")","v":""}]
[null,null,{"$f":"IFERROR(VLOOKUP(VALUE($B$56),'Input Calculation'!$A$2:$AJ$29,19),\"\")","v":""},{"$f":"_xlfn.IFNA(VLOOKUP($C61,'Product Information'!$A$2:$C$31,2),\"\")","v":""},{"$f":"_xlfn.IFNA(VLOOKUP($C61,'Product Information'!$A$2:$C$31,3),\"\")","v":""}]
[null,null,{"$f":"IFERROR(VLOOKUP(VALUE($B$56),'Input Calculation'!$A$2:$AJ$29,21),\"\")","v":""},{"$f":"_xlfn.IFNA(VLOOKUP($C62,'Product Information'!$A$2:$C$31,2),\"\")","v":""},{"$f":"_xlfn.IFNA(VLOOKUP($C62,'Product Information'!$A$2:$C$31,3),\"\")","v":""}]
[null,null,{"$f":"IFERROR(VLOOKUP(VALUE($B$56),'Input Calculation'!$A$2:$AJ$29,23),\"\")","v":""},{"$f":"_xlfn.IFNA(VLOOKUP($C63,'Product Information'!$A$2:$C$31,2),\"\")","v":""},{"$f":"_xlfn.IFNA(VLOOKUP($C63,'Product Information'!$A$2:$C$31,3),\"\")","v":""}]
[null,null,{"$f":"IFERROR(VLOOKUP(VALUE($B$56),'Input Calculation'!$A$2:$AJ$29,25),\"\")","v":""},{"$f":"_xlfn.IFNA(VLOOKUP($C64,'Product Information'!$A$2:$C$31,2),\"\")","v":""},{"$f":"_xlfn.IFNA(VLOOKUP($C64,'Product Information'!$A$2:$C$31,3),\"\")","v":""}]
[null,null,{"$f":"IFERROR(VLOOKUP(VALUE($B$56),'Input Calculation'!$A$2:$AJ$29,27),\"\")","v":""},{"$f":"_xlfn.IFNA(VLOOKUP($C65,'Product Information'!$A$2:$C$31,2),\"\")","v":""},{"$f":"_xlfn.IFNA(VLOOKUP($C65,'Product Information'!$A$2:$C$31,3),\"\")","v":""}]
[null,null,null,"Total:",{"$f":"IFERROR(VLOOKUP(VALUE($B$56),'Input Calculation'!$A$2:$AJ$29,36),\"\")","v":""},"Notes: "]
[]
[null,{"$f":"MID($A$7,LEN(B8)+LEN(B20)+LEN(B32)+LEN(B44)+LEN(B56)+1,4)","v":""},{"$f":"IFERROR(VLOOKUP(VALUE($B$68),'Input Calculation'!$A$2:$AJ$29,9),\"\")","v":""},{"$f":"_xlfn.IFNA(VLOOKUP($C68,'Product Information'!$A$2:$C$31,2),\"\")","v":""},{"$f":"_xlfn.IFNA(VLOOKUP($C68,'Product Information'!$A$2:$C$31,3),\"\")","v":""}]
[null,null,{"$f":"IFERROR(VLOOKUP(VALUE($B$68),'Input Calculation'!$A$2:$AJ$29,11),\"\")","v":""},{"$f":"_xlfn.IFNA(VLOOKUP($C69,'Product Information'!$A$2:$C$31,2),\"\")","v":""},{"$f":"_xlfn.IFNA(VLOOKUP($C69,'Product Information'!$A$2:$C$31,3),\"\")","v":""}]
[null,null,{"$f":"IFERROR(VLOOKUP(VALUE($B$68),'Input Calculation'!$A$2:$AJ$29,13),\"\")","v":""},{"$f":"_xlfn.IFNA(VLOOKUP($C70,'Product Information'!$A$2:$C$31,2),\"\")","v":""},{"$f":"_xlfn.IFNA(VLOOKUP($C70,'Product Information'!$A$2:$C$31,3),\"\")","v":""}]
[null,null,{"$f":"IFERROR(VLOOKUP(VALUE($B$68),'Input Calculation'!$A$2:$AJ$29,15),\"\")","v":""},{"$f":"_xlfn.IFNA(VLOOKUP($C71,'Product Information'!$A$2:$C$31,2),\"\")","v":""},{"$f":"_xlfn.IFNA(VLOOKUP($C71,'Product Information'!$A$2:$C$31,3),\"\")","v":""}]
[null,null,{"$f":"IFERROR(VLOOKUP(VALUE($B$68),'Input Calculation'!$A$2:$AJ$29,17),\"\")","v":""},{"$f":"_xlfn.IFNA(VLOOKUP($C72,'Product Information'!$A$2:$C$31,2),\"\")","v":""},{"$f":"_xlfn.IFNA(VLOOKUP($C72,'Product Information'!$A$2:$C$31,3),\"\")","v":""}]
[null,null,{"$f":"IFERROR(VLOOKUP(VALUE($B$68),'Input Calculation'!$A$2:$AJ$29,19),\"\")","v":""},{"$f":"_xlfn.IFNA(VLOOKUP($C73,'Product Information'!$A$2:$C$31,2),\"\")","v":""},{"$f":"_xlfn.IFNA(VLOOKUP($C73,'Product Information'!$A$2:$C$31,3),\"\")","v":""}]
[null,null,{"$f":"IFERROR(VLOOKUP(VALUE($B$68),'Input Calculation'!$A$2:$AJ$29,21),\"\")","v":""},{"$f":"_xlfn.IFNA(VLOOKUP($C74,'Product Information'!$A$2:$C$31,2),\"\")","v":""},{"$f":"_xlfn.IFNA(VLOOKUP($C74,'Product Information'!$A$2:$C$31,3),\"\")","v":""}]
[null,null,{"$f":"IFERROR(VLOOKUP(VALUE($B$68),'Input Calculation'!$A$2:$AJ$29,23),\"\")","v":""},{"$f":"_xlfn.IFNA(VLOOKUP($C75,'Product Information'!$A$2:$C$31,2),\"\")","v":""},{"$f":"_xlfn.IFNA(VLOOKUP($C75,'Product Information'!$A$2:$C$31,3),\"\")","v":""}]
[null,null,{"$f":"IFERROR(VLOOKUP(VALUE($B$68),'Input Calculation'!$A$2:$AJ$29,25),\"\")","v":""},{"$f":"_xlfn.IFNA(VLOOKUP($C76,'Product Information'!$A$2:$C$31,2),\"\")","v":""},{"$f":"_xlfn.IFNA(VLOOKUP($C76,'Product Information'!$A$2:$C$31,3),\"\")","v":""}]
[null,null,{"$f":"IFERROR(VLOOKUP(VALUE($B$68),'Input Calculation'!$A$2:$AJ$29,27),\"\")","v":""},{"$f":"_xlfn.IFNA(VLOOKUP($C77,'Product Information'!$A$2:$C$31,2),\"\")","v":""},{"$f":"_xlfn.IFNA(VLOOKUP($C77,'Product Information'!$A$2:$C$31,3),\"\")","v":""}]
[null,null,null,"Total:",{"$f":"IFERROR(VLOOKUP(VALUE($B$68),'Input Calculation'!$A$2:$AJ$29,36),\"\")","v":""},"Notes: "]

{"sheet":"9184329830","index":17,"n_rows":78,"n_cols":7,"rows_kept":78,"cut":false,"hidden":true,"merged":[]}
["Name:",{"$f":"VLOOKUP(9184329830,'Customer Information'!$A$2:$I$12,2)","v":"Jane Mary"}]
["Phone:",{"$f":"TEXT(9184329830,\"###-###-####\")","v":"918-432-9830"}]
["Email:",{"$f":"VLOOKUP(9184329830,'Customer Information'!$A$2:$I$12,3)","v":"high@gmail.com"}]
["Address:",{"$f":"CONCATENATE(VLOOKUP(9184329830,'Customer Information'!$A$2:$I$12,4),\", \",VLOOKUP(9184329830,'Customer Information'!$A$2:$I$12,5),\", \",VLOOKUP(9184329830,'Customer Information'!$A$2:$I$12,6),\" \",VLOOKUP(9184329830,'Customer Information'!$A$2:$I$12,7))","v":"420 Weed Way, Denver, CO 88325"}]
["Customer Since:",{"$f":"VLOOKUP(9184329830,'Customer Information'!$A$2:$I$12,8)","v":2001}]
["Good Standing:",{"$f":"VLOOKUP(9184329830,'Customer Information'!$A$2:$I$12,9)","v":"No"}]
[{"$f":"CONCATENATE(A8,A9,A10,A11,A12,A13,A14,A15,A16,A17,A18,A19,A20,A21,A22,A23,A24,A25,A26,A27,A28,A29,A30,A31,A32,A33,A34,A35,A36)","v":"1004100810171028"},"Order Number"]
[{"$f":"IF('Input Calculation'!B2=9184329830,'Input Calculation'!A2,\"\")","v":""},{"$f":"MID($A$7,ROW()-7,4)","v":"1004"},{"$f":"IFERROR(VLOOKUP(VALUE($B$8),'Input Calculation'!$A$2:$AJ$29,9),\"\")","v":8924251},{"$f":"_xlfn.IFNA(VLOOKUP($C8,'Product Information'!$A$2:$C$31,2),\"\")","v":"Super Sunglasses"},{"$f":"_xlfn.IFNA(VLOOKUP($C8,'Product Information'!$A$2:$C$31,3),\"\")","v":99.99}]
[{"$f":"IF('Input Calculation'!B3=9184329830,'Input Calculation'!A3,\"\")","v":""},null,{"$f":"IFERROR(VLOOKUP(VALUE($B$8),'Input Calculation'!$A$2:$AJ$29,11),\"\")","v":7250412},{"$f":"_xlfn.IFNA(VLOOKUP($C9,'Product Information'!$A$2:$C$31,2),\"\")","v":"Thermal Socks"},{"$f":"_xlfn.IFNA(VLOOKUP($C9,'Product Information'!$A$2:$C$31,3),\"\")","v":12.99}]
[{"$f":"IF('Input Calculation'!B4=9184329830,'Input Calculation'!A4,\"\")","v":""},null,{"$f":"IFERROR(VLOOKUP(VALUE($B$8),'Input Calculation'!$A$2:$AJ$29,13),\"\")","v":5216388},{"$f":"_xlfn.IFNA(VLOOKUP($C10,'Product Information'!$A$2:$C$31,2),\"\")","v":"Logo Hat"},{"$f":"_xlfn.IFNA(VLOOKUP($C10,'Product Information'!$A$2:$C$31,3),\"\")","v":49.99}]
[{"$f":"IF('Input Calculation'!B5=9184329830,'Input Calculation'!A5,\"\")","v":1004},null,{"$f":"IFERROR(VLOOKUP(VALUE($B$8),'Input Calculation'!$A$2:$AJ$29,15),\"\")","v":""},{"$f":"_xlfn.IFNA(VLOOKUP($C11,'Product Information'!$A$2:$C$31,2),\"\")","v":""},{"$f":"_xlfn.IFNA(VLOOKUP($C11,'Product Information'!$A$2:$C$31,3),\"\")","v":""}]
[{"$f":"IF('Input Calculation'!B6=9184329830,'Input Calculation'!A6,\"\")","v":""},null,{"$f":"IFERROR(VLOOKUP(VALUE($B$8),'Input Calculation'!$A$2:$AJ$29,17),\"\")","v":""},{"$f":"_xlfn.IFNA(VLOOKUP($C12,'Product Information'!$A$2:$C$31,2),\"\")","v":""},{"$f":"_xlfn.IFNA(VLOOKUP($C12,'Product Information'!$A$2:$C$31,3),\"\")","v":""}]
[{"$f":"IF('Input Calculation'!B7=9184329830,'Input Calculation'!A7,\"\")","v":""},null,{"$f":"IFERROR(VLOOKUP(VALUE($B$8),'Input Calculation'!$A$2:$AJ$29,19),\"\")","v":""},{"$f":"_xlfn.IFNA(VLOOKUP($C13,'Product Information'!$A$2:$C$31,2),\"\")","v":""},{"$f":"_xlfn.IFNA(VLOOKUP($C13,'Product Information'!$A$2:$C$31,3),\"\")","v":""}]
[{"$f":"IF('Input Calculation'!B8=9184329830,'Input Calculation'!A8,\"\")","v":""},null,{"$f":"IFERROR(VLOOKUP(VALUE($B$8),'Input Calculation'!$A$2:$AJ$29,21),\"\")","v":""},{"$f":"_xlfn.IFNA(VLOOKUP($C14,'Product Information'!$A$2:$C$31,2),\"\")","v":""},{"$f":"_xlfn.IFNA(VLOOKUP($C14,'Product Information'!$A$2:$C$31,3),\"\")","v":""}]
[{"$f":"IF('Input Calculation'!B9=9184329830,'Input Calculation'!A9,\"\")","v":1008},null,{"$f":"IFERROR(VLOOKUP(VALUE($B$8),'Input Calculation'!$A$2:$AJ$29,23),\"\")","v":""},{"$f":"_xlfn.IFNA(VLOOKUP($C15,'Product Information'!$A$2:$C$31,2),\"\")","v":""},{"$f":"_xlfn.IFNA(VLOOKUP($C15,'Product Information'!$A$2:$C$31,3),\"\")","v":""}]
[{"$f":"IF('Input Calculation'!B10=9184329830,'Input Calculation'!A10,\"\")","v":""},null,{"$f":"IFERROR(VLOOKUP(VALUE($B$8),'Input Calculation'!$A$2:$AJ$29,25),\"\")","v":""},{"$f":"_xlfn.IFNA(VLOOKUP($C16,'Product Information'!$A$2:$C$31,2),\"\")","v":""},{"$f":"_xlfn.IFNA(VLOOKUP($C16,'Product Information'!$A$2:$C$31,3),\"\")","v":""}]
[{"$f":"IF('Input Calculation'!B11=9184329830,'Input Calculation'!A11,\"\")","v":""},null,{"$f":"IFERROR(VLOOKUP(VALUE($B$8),'Input Calculation'!$A$2:$AJ$29,27),\"\")","v":""},{"$f":"_xlfn.IFNA(VLOOKUP($C17,'Product Information'!$A$2:$C$31,2),\"\")","v":""},{"$f":"_xlfn.IFNA(VLOOKUP($C17,'Product Information'!$A$2:$C$31,3),\"\")","v":""}]
[{"$f":"IF('Input Calculation'!B12=9184329830,'Input Calculation'!A12,\"\")","v":""},null,null,"Total:",{"$f":"VLOOKUP(VALUE($B$8),'Input Calculation'!$A$2:$AJ$29,36)","v":157.9},"Notes: ","Tried to buy marijuana from sales represetative"]
[{"$f":"IF('Input Calculation'!B13=9184329830,'Input Calculation'!A13,\"\")","v":""}]
[{"$f":"IF('Input Calculation'!B14=9184329830,'Input Calculation'!A14,\"\")","v":""},{"$f":"MID($A$7,LEN(B8)+1,4)","v":"1008"},{"$f":"IFERROR(VLOOKUP(VALUE($B$20),'Input Calculation'!$A$2:$AJ$29,9),\"\")","v":8924251},{"$f":"_xlfn.IFNA(VLOOKUP($C20,'Product Information'!$A$2:$C$31,2),\"\")","v":"Super Sunglasses"},{"$f":"_xlfn.IFNA(VLOOKUP($C20,'Product Information'!$A$2:$C$31,3),\"\")","v":99.99}]
[{"$f":"IF('Input Calculation'!B15=9184329830,'Input Calculation'!A15,\"\")","v":""},null,{"$f":"IFERROR(VLOOKUP(VALUE($B$20),'Input Calculation'!$A$2:$AJ$29,11),\"\")","v":2056772},{"$f":"_xlfn.IFNA(VLOOKUP($C21,'Product Information'!$A$2:$C$31,2),\"\")","v":"Great Pants"},{"$f":"_xlfn.IFNA(VLOOKUP($C21,'Product Information'!$A$2:$C$31,3),\"\")","v":74.989999999999995}]
[{"$f":"IF('Input Calculation'!B16=9184329830,'Input Calculation'!A16,\"\")","v":""},null,{"$f":"IFERROR(VLOOKUP(VALUE($B$20),'Input Calculation'!$A$2:$AJ$29,13),\"\")","v":""},{"$f":"_xlfn.IFNA(VLOOKUP($C22,'Product Information'!$A$2:$C$31,2),\"\")","v":""},{"$f":"_xlfn.IFNA(VLOOKUP($C22,'Product Information'!$A$2:$C$31,3),\"\")","v":""}]
[{"$f":"IF('Input Calculation'!B17=9184329830,'Input Calculation'!A17,\"\")","v":""},null,{"$f":"IFERROR(VLOOKUP(VALUE($B$20),'Input Calculation'!$A$2:$AJ$29,15),\"\")","v":""},{"$f":"_xlfn.IFNA(VLOOKUP($C23,'Product Information'!$A$2:$C$31,2),\"\")","v":""},{"$f":"_xlfn.IFNA(VLOOKUP($C23,'Product Information'!$A$2:$C$31,3),\"\")","v":""}]
[{"$f":"IF('Input Calculation'!B18=9184329830,'Input Calculation'!A18,\"\")","v":1017},null,{"$f":"IFERROR(VLOOKUP(VALUE($B$20),'Input Calculation'!$A$2:$AJ$29,17),\"\")","v":""},{"$f":"_xlfn.IFNA(VLOOKUP($C24,'Product Information'!$A$2:$C$31,2),\"\")","v":""},{"$f":"_xlfn.IFNA(VLOOKUP($C24,'Product Information'!$A$2:$C$31,3),\"\")","v":""}]
[{"$f":"IF('Input Calculation'!B19=9184329830,'Input Calculation'!A19,\"\")","v":""},null,{"$f":"IFERROR(VLOOKUP(VALUE($B$20),'Input Calculation'!$A$2:$AJ$29,19),\"\")","v":""},{"$f":"_xlfn.IFNA(VLOOKUP($C25,'Product Information'!$A$2:$C$31,2),\"\")","v":""},{"$f":"_xlfn.IFNA(VLOOKUP($C25,'Product Information'!$A$2:$C$31,3),\"\")","v":""}]
[{"$f":"IF('Input Calculation'!B20=9184329830,'Input Calculation'!A20,\"\")","v":""},null,{"$f":"IFERROR(VLOOKUP(VALUE($B$20),'Input Calculation'!$A$2:$AJ$29,21),\"\")","v":""},{"$f":"_xlfn.IFNA(VLOOKUP($C26,'Product Information'!$A$2:$C$31,2),\"\")","v":""},{"$f":"_xlfn.IFNA(VLOOKUP($C26,'Product Information'!$A$2:$C$31,3),\"\")","v":""}]
[{"$f":"IF('Input Calculation'!B21=9184329830,'Input Calculation'!A21,\"\")","v":""},null,{"$f":"IFERROR(VLOOKUP(VALUE($B$20),'Input Calculation'!$A$2:$AJ$29,23),\"\")","v":""},{"$f":"_xlfn.IFNA(VLOOKUP($C27,'Product Information'!$A$2:$C$31,2),\"\")","v":""},{"$f":"_xlfn.IFNA(VLOOKUP($C27,'Product Information'!$A$2:$C$31,3),\"\")","v":""}]
[{"$f":"IF('Input Calculation'!B22=9184329830,'Input Calculation'!A22,\"\")","v":""},null,{"$f":"IFERROR(VLOOKUP(VALUE($B$20),'Input Calculation'!$A$2:$AJ$29,25),\"\")","v":""},{"$f":"_xlfn.IFNA(VLOOKUP($C28,'Product Information'!$A$2:$C$31,2),\"\")","v":""},{"$f":"_xlfn.IFNA(VLOOKUP($C28,'Product Information'!$A$2:$C$31,3),\"\")","v":""}]
[{"$f":"IF('Input Calculation'!B23=9184329830,'Input Calculation'!A23,\"\")","v":""},null,{"$f":"IFERROR(VLOOKUP(VALUE($B$20),'Input Calculation'!$A$2:$AJ$29,27),\"\")","v":""},{"$f":"_xlfn.IFNA(VLOOKUP($C29,'Product Information'!$A$2:$C$31,2),\"\")","v":""},{"$f":"_xlfn.IFNA(VLOOKUP($C29,'Product Information'!$A$2:$C$31,3),\"\")","v":""}]
[{"$f":"IF('Input Calculation'!B24=9184329830,'Input Calculation'!A24,\"\")","v":""},null,null,"Total:",{"$f":"IFERROR(VLOOKUP(VALUE($B$20),'Input Calculation'!$A$2:$AJ$29,36),\"\")","v":169.52999999999997},"Notes: "]
[{"$f":"IF('Input Calculation'!B25=9184329830,'Input Calculation'!A25,\"\")","v":""}]
[{"$f":"IF('Input Calculation'!B26=9184329830,'Input Calculation'!A26,\"\")","v":""},{"$f":"MID($A$7,LEN(B8)+LEN(B20)+1,4)","v":"1017"},{"$f":"IFERROR(VLOOKUP(VALUE($B$32),'Input Calculation'!$A$2:$AJ$29,9),\"\")","v":3055845},{"$f":"_xlfn.IFNA(VLOOKUP($C32,'Product Information'!$A$2:$C$31,2),\"\")","v":"Winter Jacket"},{"$f":"_xlfn.IFNA(VLOOKUP($C32,'Product Information'!$A$2:$C$31,3),\"\")","v":199.99}]
[{"$f":"IF('Input Calculation'!B27=9184329830,'Input Calculation'!A27,\"\")","v":""},null,{"$f":"IFERROR(VLOOKUP(VALUE($B$32),'Input Calculation'!$A$2:$AJ$29,11),\"\")","v":""},{"$f":"_xlfn.IFNA(VLOOKUP($C33,'Product Information'!$A$2:$C$31,2),\"\")","v":""},{"$f":"_xlfn.IFNA(VLOOKUP($C33,'Product Information'!$A$2:$C$31,3),\"\")","v":""}]
[{"$f":"IF('Input Calculation'!B28=9184329830,'Input Calculation'!A28,\"\")","v":""},null,{"$f":"IFERROR(VLOOKUP(VALUE($B$32),'Input Calculation'!$A$2:$AJ$29,13),\"\")","v":""},{"$f":"_xlfn.IFNA(VLOOKUP($C34,'Product Information'!$A$2:$C$31,2),\"\")","v":""},{"$f":"_xlfn.IFNA(VLOOKUP($C34,'Product Information'!$A$2:$C$31,3),\"\")","v":""}]
[{"$f":"IF('Input Calculation'!B29=9184329830,'Input Calculation'!A29,\"\")","v":1028},null,{"$f":"IFERROR(VLOOKUP(VALUE($B$32),'Input Calculation'!$A$2:$AJ$29,15),\"\")","v":""},{"$f":"_xlfn.IFNA(VLOOKUP($C35,'Product Information'!$A$2:$C$31,2),\"\")","v":""},{"$f":"_xlfn.IFNA(VLOOKUP($C35,'Product Information'!$A$2:$C$31,3),\"\")","v":""}]
[{"$f":"IF('Input Calculation'!B30=9184329830,'Input Calculation'!A30,\"\")","v":""},null,{"$f":"IFERROR(VLOOKUP(VALUE($B$32),'Input Calculation'!$A$2:$AJ$29,17),\"\")","v":""},{"$f":"_xlfn.IFNA(VLOOKUP($C36,'Product Information'!$A$2:$C$31,2),\"\")","v":""},{"$f":"_xlfn.IFNA(VLOOKUP($C36,'Product Information'!$A$2:$C$31,3),\"\")","v":""}]
[null,null,{"$f":"IFERROR(VLOOKUP(VALUE($B$32),'Input Calculation'!$A$2:$AJ$29,19),\"\")","v":""},{"$f":"_xlfn.IFNA(VLOOKUP($C37,'Product Information'!$A$2:$C$31,2),\"\")","v":""},{"$f":"_xlfn.IFNA(VLOOKUP($C37,'Product Information'!$A$2:$C$31,3),\"\")","v":""}]
[null,null,{"$f":"IFERROR(VLOOKUP(VALUE($B$32),'Input Calculation'!$A$2:$AJ$29,21),\"\")","v":""},{"$f":"_xlfn.IFNA(VLOOKUP($C38,'Product Information'!$A$2:$C$31,2),\"\")","v":""},{"$f":"_xlfn.IFNA(VLOOKUP($C38,'Product Information'!$A$2:$C$31,3),\"\")","v":""}]
[null,null,{"$f":"IFERROR(VLOOKUP(VALUE($B$32),'Input Calculation'!$A$2:$AJ$29,23),\"\")","v":""},{"$f":"_xlfn.IFNA(VLOOKUP($C39,'Product Information'!$A$2:$C$31,2),\"\")","v":""},{"$f":"_xlfn.IFNA(VLOOKUP($C39,'Product Information'!$A$2:$C$31,3),\"\")","v":""}]
[null,null,{"$f":"IFERROR(VLOOKUP(VALUE($B$32),'Input Calculation'!$A$2:$AJ$29,25),\"\")","v":""},{"$f":"_xlfn.IFNA(VLOOKUP($C40,'Product Information'!$A$2:$C$31,2),\"\")","v":""},{"$f":"_xlfn.IFNA(VLOOKUP($C40,'Product Information'!$A$2:$C$31,3),\"\")","v":""}]
[null,null,{"$f":"IFERROR(VLOOKUP(VALUE($B$32),'Input Calculation'!$A$2:$AJ$29,27),\"\")","v":""},{"$f":"_xlfn.IFNA(VLOOKUP($C41,'Product Information'!$A$2:$C$31,2),\"\")","v":""},{"$f":"_xlfn.IFNA(VLOOKUP($C41,'Product Information'!$A$2:$C$31,3),\"\")","v":""}]
[null,null,null,"Total:",{"$f":"IFERROR(VLOOKUP(VALUE($B$32),'Input Calculation'!$A$2:$AJ$29,36),\"\")","v":193.77},"Notes: "]
[]
[null,{"$f":"MID($A$7,LEN(B8)+LEN(B20)+LEN(B32)+1,4)","v":"1028"},{"$f":"IFERROR(VLOOKUP(VALUE($B$44),'Input Calculation'!$A$2:$AJ$29,9),\"\")","v":2056772},{"$f":"_xlfn.IFNA(VLOOKUP($C44,'Product Information'!$A$2:$C$31,2),\"\")","v":"Great Pants"},{"$f":"_xlfn.IFNA(VLOOKUP($C44,'Product Information'!$A$2:$C$31,3),\"\")","v":74.989999999999995}]
[null,null,{"$f":"IFERROR(VLOOKUP(VALUE($B$44),'Input Calculation'!$A$2:$AJ$29,11),\"\")","v":""},{"$f":"_xlfn.IFNA(VLOOKUP($C45,'Product Information'!$A$2:$C$31,2),\"\")","v":""},{"$f":"_xlfn.IFNA(VLOOKUP($C45,'Product Information'!$A$2:$C$31,3),\"\")","v":""}]
[null,null,{"$f":"IFERROR(VLOOKUP(VALUE($B$44),'Input Calculation'!$A$2:$AJ$29,13),\"\")","v":""},{"$f":"_xlfn.IFNA(VLOOKUP($C46,'Product Information'!$A$2:$C$31,2),\"\")","v":""},{"$f":"_xlfn.IFNA(VLOOKUP($C46,'Product Information'!$A$2:$C$31,3),\"\")","v":""}]
[null,null,{"$f":"IFERROR(VLOOKUP(VALUE($B$44),'Input Calculation'!$A$2:$AJ$29,15),\"\")","v":""},{"$f":"_xlfn.IFNA(VLOOKUP($C47,'Product Information'!$A$2:$C$31,2),\"\")","v":""},{"$f":"_xlfn.IFNA(VLOOKUP($C47,'Product Information'!$A$2:$C$31,3),\"\")","v":""}]
[null,null,{"$f":"IFERROR(VLOOKUP(VALUE($B$44),'Input Calculation'!$A$2:$AJ$29,17),\"\")","v":""},{"$f":"_xlfn.IFNA(VLOOKUP($C48,'Product Information'!$A$2:$C$31,2),\"\")","v":""},{"$f":"_xlfn.IFNA(VLOOKUP($C48,'Product Information'!$A$2:$C$31,3),\"\")","v":""}]
[null,null,{"$f":"IFERROR(VLOOKUP(VALUE($B$44),'Input Calculation'!$A$2:$AJ$29,19),\"\")","v":""},{"$f":"_xlfn.IFNA(VLOOKUP($C49,'Product Information'!$A$2:$C$31,2),\"\")","v":""},{"$f":"_xlfn.IFNA(VLOOKUP($C49,'Product Information'!$A$2:$C$31,3),\"\")","v":""}]
[null,null,{"$f":"IFERROR(VLOOKUP(VALUE($B$44),'Input Calculation'!$A$2:$AJ$29,21),\"\")","v":""},{"$f":"_xlfn.IFNA(VLOOKUP($C50,'Product Information'!$A$2:$C$31,2),\"\")","v":""},{"$f":"_xlfn.IFNA(VLOOKUP($C50,'Product Information'!$A$2:$C$31,3),\"\")","v":""}]
[null,null,{"$f":"IFERROR(VLOOKUP(VALUE($B$44),'Input Calculation'!$A$2:$AJ$29,23),\"\")","v":""},{"$f":"_xlfn.IFNA(VLOOKUP($C51,'Product Information'!$A$2:$C$31,2),\"\")","v":""},{"$f":"_xlfn.IFNA(VLOOKUP($C51,'Product Information'!$A$2:$C$31,3),\"\")","v":""}]
[null,null,{"$f":"IFERROR(VLOOKUP(VALUE($B$44),'Input Calculation'!$A$2:$AJ$29,25),\"\")","v":""},{"$f":"_xlfn.IFNA(VLOOKUP($C52,'Product Information'!$A$2:$C$31,2),\"\")","v":""},{"$f":"_xlfn.IFNA(VLOOKUP($C52,'Product Information'!$A$2:$C$31,3),\"\")","v":""}]
[null,null,{"$f":"IFERROR(VLOOKUP(VALUE($B$44),'Input Calculation'!$A$2:$AJ$29,27),\"\")","v":""},{"$f":"_xlfn.IFNA(VLOOKUP($C53,'Product Information'!$A$2:$C$31,2),\"\")","v":""},{"$f":"_xlfn.IFNA(VLOOKUP($C53,'Product Information'!$A$2:$C$31,3),\"\")","v":""}]
[null,null,null,"Total:",{"$f":"IFERROR(VLOOKUP(VALUE($B$44),'Input Calculation'!$A$2:$AJ$29,36),\"\")","v":72.66},"Notes: ","Flirted with sales representative"]
[]
[null,{"$f":"MID($A$7,LEN(B8)+LEN(B20)+LEN(B32)+LEN(B44)+1,4)","v":""},{"$f":"IFERROR(VLOOKUP(VALUE($B$56),'Input Calculation'!$A$2:$AJ$29,9),\"\")","v":""},{"$f":"_xlfn.IFNA(VLOOKUP($C56,'Product Information'!$A$2:$C$31,2),\"\")","v":""},{"$f":"_xlfn.IFNA(VLOOKUP($C56,'Product Information'!$A$2:$C$31,3),\"\")","v":""}]
[null,null,{"$f":"IFERROR(VLOOKUP(VALUE($B$56),'Input Calculation'!$A$2:$AJ$29,11),\"\")","v":""},{"$f":"_xlfn.IFNA(VLOOKUP($C57,'Product Information'!$A$2:$C$31,2),\"\")","v":""},{"$f":"_xlfn.IFNA(VLOOKUP($C57,'Product Information'!$A$2:$C$31,3),\"\")","v":""}]
[null,null,{"$f":"IFERROR(VLOOKUP(VALUE($B$56),'Input Calculation'!$A$2:$AJ$29,13),\"\")","v":""},{"$f":"_xlfn.IFNA(VLOOKUP($C58,'Product Information'!$A$2:$C$31,2),\"\")","v":""},{"$f":"_xlfn.IFNA(VLOOKUP($C58,'Product Information'!$A$2:$C$31,3),\"\")","v":""}]
[null,null,{"$f":"IFERROR(VLOOKUP(VALUE($B$56),'Input Calculation'!$A$2:$AJ$29,15),\"\")","v":""},{"$f":"_xlfn.IFNA(VLOOKUP($C59,'Product Information'!$A$2:$C$31,2),\"\")","v":""},{"$f":"_xlfn.IFNA(VLOOKUP($C59,'Product Information'!$A$2:$C$31,3),\"\")","v":""}]
[null,null,{"$f":"IFERROR(VLOOKUP(VALUE($B$56),'Input Calculation'!$A$2:$AJ$29,17),\"\")","v":""},{"$f":"_xlfn.IFNA(VLOOKUP($C60,'Product Information'!$A$2:$C$31,2),\"\")","v":""},{"$f":"_xlfn.IFNA(VLOOKUP($C60,'Product Information'!$A$2:$C$31,3),\"\")","v":""}]
[null,null,{"$f":"IFERROR(VLOOKUP(VALUE($B$56),'Input Calculation'!$A$2:$AJ$29,19),\"\")","v":""},{"$f":"_xlfn.IFNA(VLOOKUP($C61,'Product Information'!$A$2:$C$31,2),\"\")","v":""},{"$f":"_xlfn.IFNA(VLOOKUP($C61,'Product Information'!$A$2:$C$31,3),\"\")","v":""}]
[null,null,{"$f":"IFERROR(VLOOKUP(VALUE($B$56),'Input Calculation'!$A$2:$AJ$29,21),\"\")","v":""},{"$f":"_xlfn.IFNA(VLOOKUP($C62,'Product Information'!$A$2:$C$31,2),\"\")","v":""},{"$f":"_xlfn.IFNA(VLOOKUP($C62,'Product Information'!$A$2:$C$31,3),\"\")","v":""}]
[null,null,{"$f":"IFERROR(VLOOKUP(VALUE($B$56),'Input Calculation'!$A$2:$AJ$29,23),\"\")","v":""},{"$f":"_xlfn.IFNA(VLOOKUP($C63,'Product Information'!$A$2:$C$31,2),\"\")","v":""},{"$f":"_xlfn.IFNA(VLOOKUP($C63,'Product Information'!$A$2:$C$31,3),\"\")","v":""}]
[null,null,{"$f":"IFERROR(VLOOKUP(VALUE($B$56),'Input Calculation'!$A$2:$AJ$29,25),\"\")","v":""},{"$f":"_xlfn.IFNA(VLOOKUP($C64,'Product Information'!$A$2:$C$31,2),\"\")","v":""},{"$f":"_xlfn.IFNA(VLOOKUP($C64,'Product Information'!$A$2:$C$31,3),\"\")","v":""}]
[null,null,{"$f":"IFERROR(VLOOKUP(VALUE($B$56),'Input Calculation'!$A$2:$AJ$29,27),\"\")","v":""},{"$f":"_xlfn.IFNA(VLOOKUP($C65,'Product Information'!$A$2:$C$31,2),\"\")","v":""},{"$f":"_xlfn.IFNA(VLOOKUP($C65,'Product Information'!$A$2:$C$31,3),\"\")","v":""}]
[null,null,null,"Total:",{"$f":"IFERROR(VLOOKUP(VALUE($B$56),'Input Calculation'!$A$2:$AJ$29,36),\"\")","v":""},"Notes: "]
[]
[null,{"$f":"MID($A$7,LEN(B8)+LEN(B20)+LEN(B32)+LEN(B44)+LEN(B56)+1,4)","v":""},{"$f":"IFERROR(VLOOKUP(VALUE($B$68),'Input Calculation'!$A$2:$AJ$29,9),\"\")","v":""},{"$f":"_xlfn.IFNA(VLOOKUP($C68,'Product Information'!$A$2:$C$31,2),\"\")","v":""},{"$f":"_xlfn.IFNA(VLOOKUP($C68,'Product Information'!$A$2:$C$31,3),\"\")","v":""}]
[null,null,{"$f":"IFERROR(VLOOKUP(VALUE($B$68),'Input Calculation'!$A$2:$AJ$29,11),\"\")","v":""},{"$f":"_xlfn.IFNA(VLOOKUP($C69,'Product Information'!$A$2:$C$31,2),\"\")","v":""},{"$f":"_xlfn.IFNA(VLOOKUP($C69,'Product Information'!$A$2:$C$31,3),\"\")","v":""}]
[null,null,{"$f":"IFERROR(VLOOKUP(VALUE($B$68),'Input Calculation'!$A$2:$AJ$29,13),\"\")","v":""},{"$f":"_xlfn.IFNA(VLOOKUP($C70,'Product Information'!$A$2:$C$31,2),\"\")","v":""},{"$f":"_xlfn.IFNA(VLOOKUP($C70,'Product Information'!$A$2:$C$31,3),\"\")","v":""}]
[null,null,{"$f":"IFERROR(VLOOKUP(VALUE($B$68),'Input Calculation'!$A$2:$AJ$29,15),\"\")","v":""},{"$f":"_xlfn.IFNA(VLOOKUP($C71,'Product Information'!$A$2:$C$31,2),\"\")","v":""},{"$f":"_xlfn.IFNA(VLOOKUP($C71,'Product Information'!$A$2:$C$31,3),\"\")","v":""}]
[null,null,{"$f":"IFERROR(VLOOKUP(VALUE($B$68),'Input Calculation'!$A$2:$AJ$29,17),\"\")","v":""},{"$f":"_xlfn.IFNA(VLOOKUP($C72,'Product Information'!$A$2:$C$31,2),\"\")","v":""},{"$f":"_xlfn.IFNA(VLOOKUP($C72,'Product Information'!$A$2:$C$31,3),\"\")","v":""}]
[null,null,{"$f":"IFERROR(VLOOKUP(VALUE($B$68),'Input Calculation'!$A$2:$AJ$29,19),\"\")","v":""},{"$f":"_xlfn.IFNA(VLOOKUP($C73,'Product Information'!$A$2:$C$31,2),\"\")","v":""},{"$f":"_xlfn.IFNA(VLOOKUP($C73,'Product Information'!$A$2:$C$31,3),\"\")","v":""}]
[null,null,{"$f":"IFERROR(VLOOKUP(VALUE($B$68),'Input Calculation'!$A$2:$AJ$29,21),\"\")","v":""},{"$f":"_xlfn.IFNA(VLOOKUP($C74,'Product Information'!$A$2:$C$31,2),\"\")","v":""},{"$f":"_xlfn.IFNA(VLOOKUP($C74,'Product Information'!$A$2:$C$31,3),\"\")","v":""}]
[null,null,{"$f":"IFERROR(VLOOKUP(VALUE($B$68),'Input Calculation'!$A$2:$AJ$29,23),\"\")","v":""},{"$f":"_xlfn.IFNA(VLOOKUP($C75,'Product Information'!$A$2:$C$31,2),\"\")","v":""},{"$f":"_xlfn.IFNA(VLOOKUP($C75,'Product Information'!$A$2:$C$31,3),\"\")","v":""}]
[null,null,{"$f":"IFERROR(VLOOKUP(VALUE($B$68),'Input Calculation'!$A$2:$AJ$29,25),\"\")","v":""},{"$f":"_xlfn.IFNA(VLOOKUP($C76,'Product Information'!$A$2:$C$31,2),\"\")","v":""},{"$f":"_xlfn.IFNA(VLOOKUP($C76,'Product Information'!$A$2:$C$31,3),\"\")","v":""}]
[null,null,{"$f":"IFERROR(VLOOKUP(VALUE($B$68),'Input Calculation'!$A$2:$AJ$29,27),\"\")","v":""},{"$f":"_xlfn.IFNA(VLOOKUP($C77,'Product Information'!$A$2:$C$31,2),\"\")","v":""},{"$f":"_xlfn.IFNA(VLOOKUP($C77,'Product Information'!$A$2:$C$31,3),\"\")","v":""}]
[null,null,null,"Total:",{"$f":"IFERROR(VLOOKUP(VALUE($B$68),'Input Calculation'!$A$2:$AJ$29,36),\"\")","v":""},"Notes: "]

{"sheet":"9224318825","index":18,"n_rows":78,"n_cols":6,"rows_kept":78,"cut":false,"hidden":true,"merged":[]}
["Name:",{"$f":"VLOOKUP(9224318825,'Customer Information'!$A$2:$I$12,2)","v":"N'Charge Charles"}]
["Phone:",{"$f":"TEXT(9224318825,\"###-###-####\")","v":"922-431-8825"}]
["Email:",{"$f":"VLOOKUP(9224318825,'Customer Information'!$A$2:$I$12,3)","v":"boss@hotmail.com"}]
["Address:",{"$f":"CONCATENATE(VLOOKUP(9224318825,'Customer Information'!$A$2:$I$12,4),\", \",VLOOKUP(9224318825,'Customer Information'!$A$2:$I$12,5),\", \",VLOOKUP(9224318825,'Customer Information'!$A$2:$I$12,6),\" \",VLOOKUP(9224318825,'Customer Information'!$A$2:$I$12,7))","v":"12 Wandering Road, Laffyette, LA 76523"}]
["Customer Since:",{"$f":"VLOOKUP(9224318825,'Customer Information'!$A$2:$I$12,8)","v":2015}]
["Good Standing:",{"$f":"VLOOKUP(9224318825,'Customer Information'!$A$2:$I$12,9)","v":"Yes"}]
[{"$f":"CONCATENATE(A8,A9,A10,A11,A12,A13,A14,A15,A16,A17,A18,A19,A20,A21,A22,A23,A24,A25,A26,A27,A28,A29,A30,A31,A32,A33,A34,A35,A36)","v":"1019"},"Order Number"]
[{"$f":"IF('Input Calculation'!B2=9224318825,'Input Calculation'!A2,\"\")","v":""},{"$f":"MID($A$7,ROW()-7,4)","v":"1019"},{"$f":"IFERROR(VLOOKUP(VALUE($B$8),'Input Calculation'!$A$2:$AJ$29,9),\"\")","v":8924251},{"$f":"_xlfn.IFNA(VLOOKUP($C8,'Product Information'!$A$2:$C$31,2),\"\")","v":"Super Sunglasses"},{"$f":"_xlfn.IFNA(VLOOKUP($C8,'Product Information'!$A$2:$C$31,3),\"\")","v":99.99}]
[{"$f":"IF('Input Calculation'!B3=9224318825,'Input Calculation'!A3,\"\")","v":""},null,{"$f":"IFERROR(VLOOKUP(VALUE($B$8),'Input Calculation'!$A$2:$AJ$29,11),\"\")","v":5216388},{"$f":"_xlfn.IFNA(VLOOKUP($C9,'Product Information'!$A$2:$C$31,2),\"\")","v":"Logo Hat"},{"$f":"_xlfn.IFNA(VLOOKUP($C9,'Product Information'!$A$2:$C$31,3),\"\")","v":49.99}]
[{"$f":"IF('Input Calculation'!B4=9224318825,'Input Calculation'!A4,\"\")","v":""},null,{"$f":"IFERROR(VLOOKUP(VALUE($B$8),'Input Calculation'!$A$2:$AJ$29,13),\"\")","v":""},{"$f":"_xlfn.IFNA(VLOOKUP($C10,'Product Information'!$A$2:$C$31,2),\"\")","v":""},{"$f":"_xlfn.IFNA(VLOOKUP($C10,'Product Information'!$A$2:$C$31,3),\"\")","v":""}]
[{"$f":"IF('Input Calculation'!B5=9224318825,'Input Calculation'!A5,\"\")","v":""},null,{"$f":"IFERROR(VLOOKUP(VALUE($B$8),'Input Calculation'!$A$2:$AJ$29,15),\"\")","v":""},{"$f":"_xlfn.IFNA(VLOOKUP($C11,'Product Information'!$A$2:$C$31,2),\"\")","v":""},{"$f":"_xlfn.IFNA(VLOOKUP($C11,'Product Information'!$A$2:$C$31,3),\"\")","v":""}]
[{"$f":"IF('Input Calculation'!B6=9224318825,'Input Calculation'!A6,\"\")","v":""},null,{"$f":"IFERROR(VLOOKUP(VALUE($B$8),'Input Calculation'!$A$2:$AJ$29,17),\"\")","v":""},{"$f":"_xlfn.IFNA(VLOOKUP($C12,'Product Information'!$A$2:$C$31,2),\"\")","v":""},{"$f":"_xlfn.IFNA(VLOOKUP($C12,'Product Information'!$A$2:$C$31,3),\"\")","v":""}]
[{"$f":"IF('Input Calculation'!B7=9224318825,'Input Calculation'!A7,\"\")","v":""},null,{"$f":"IFERROR(VLOOKUP(VALUE($B$8),'Input Calculation'!$A$2:$AJ$29,19),\"\")","v":""},{"$f":"_xlfn.IFNA(VLOOKUP($C13,'Product Information'!$A$2:$C$31,2),\"\")","v":""},{"$f":"_xlfn.IFNA(VLOOKUP($C13,'Product Information'!$A$2:$C$31,3),\"\")","v":""}]
[{"$f":"IF('Input Calculation'!B8=9224318825,'Input Calculation'!A8,\"\")","v":""},null,{"$f":"IFERROR(VLOOKUP(VALUE($B$8),'Input Calculation'!$A$2:$AJ$29,21),\"\")","v":""},{"$f":"_xlfn.IFNA(VLOOKUP($C14,'Product Information'!$A$2:$C$31,2),\"\")","v":""},{"$f":"_xlfn.IFNA(VLOOKUP($C14,'Product Information'!$A$2:$C$31,3),\"\")","v":""}]
[{"$f":"IF('Input Calculation'!B9=9224318825,'Input Calculation'!A9,\"\")","v":""},null,{"$f":"IFERROR(VLOOKUP(VALUE($B$8),'Input Calculation'!$A$2:$AJ$29,23),\"\")","v":""},{"$f":"_xlfn.IFNA(VLOOKUP($C15,'Product Information'!$A$2:$C$31,2),\"\")","v":""},{"$f":"_xlfn.IFNA(VLOOKUP($C15,'Product Information'!$A$2:$C$31,3),\"\")","v":""}]
[{"$f":"IF('Input Calculation'!B10=9224318825,'Input Calculation'!A10,\"\")","v":""},null,{"$f":"IFERROR(VLOOKUP(VALUE($B$8),'Input Calculation'!$A$2:$AJ$29,25),\"\")","v":""},{"$f":"_xlfn.IFNA(VLOOKUP($C16,'Product Information'!$A$2:$C$31,2),\"\")","v":""},{"$f":"_xlfn.IFNA(VLOOKUP($C16,'Product Information'!$A$2:$C$31,3),\"\")","v":""}]
[{"$f":"IF('Input Calculation'!B11=9224318825,'Input Calculation'!A11,\"\")","v":""},null,{"$f":"IFERROR(VLOOKUP(VALUE($B$8),'Input Calculation'!$A$2:$AJ$29,27),\"\")","v":""},{"$f":"_xlfn.IFNA(VLOOKUP($C17,'Product Information'!$A$2:$C$31,2),\"\")","v":""},{"$f":"_xlfn.IFNA(VLOOKUP($C17,'Product Information'!$A$2:$C$31,3),\"\")","v":""}]
[{"$f":"IF('Input Calculation'!B12=9224318825,'Input Calculation'!A12,\"\")","v":""},null,null,"Total:",{"$f":"VLOOKUP(VALUE($B$8),'Input Calculation'!$A$2:$AJ$29,36)","v":168.79},"Notes: "]
[{"$f":"IF('Input Calculation'!B13=9224318825,'Input Calculation'!A13,\"\")","v":""}]
[{"$f":"IF('Input Calculation'!B14=9224318825,'Input Calculation'!A14,\"\")","v":""},{"$f":"MID($A$7,LEN(B8)+1,4)","v":""},{"$f":"IFERROR(VLOOKUP(VALUE($B$20),'Input Calculation'!$A$2:$AJ$29,9),\"\")","v":""},{"$f":"_xlfn.IFNA(VLOOKUP($C20,'Product Information'!$A$2:$C$31,2),\"\")","v":""},{"$f":"_xlfn.IFNA(VLOOKUP($C20,'Product Information'!$A$2:$C$31,3),\"\")","v":""}]
[{"$f":"IF('Input Calculation'!B15=9224318825,'Input Calculation'!A15,\"\")","v":""},null,{"$f":"IFERROR(VLOOKUP(VALUE($B$20),'Input Calculation'!$A$2:$AJ$29,11),\"\")","v":""},{"$f":"_xlfn.IFNA(VLOOKUP($C21,'Product Information'!$A$2:$C$31,2),\"\")","v":""},{"$f":"_xlfn.IFNA(VLOOKUP($C21,'Product Information'!$A$2:$C$31,3),\"\")","v":""}]
[{"$f":"IF('Input Calculation'!B16=9224318825,'Input Calculation'!A16,\"\")","v":""},null,{"$f":"IFERROR(VLOOKUP(VALUE($B$20),'Input Calculation'!$A$2:$AJ$29,13),\"\")","v":""},{"$f":"_xlfn.IFNA(VLOOKUP($C22,'Product Information'!$A$2:$C$31,2),\"\")","v":""},{"$f":"_xlfn.IFNA(VLOOKUP($C22,'Product Information'!$A$2:$C$31,3),\"\")","v":""}]
[{"$f":"IF('Input Calculation'!B17=9224318825,'Input Calculation'!A17,\"\")","v":""},null,{"$f":"IFERROR(VLOOKUP(VALUE($B$20),'Input Calculation'!$A$2:$AJ$29,15),\"\")","v":""},{"$f":"_xlfn.IFNA(VLOOKUP($C23,'Product Information'!$A$2:$C$31,2),\"\")","v":""},{"$f":"_xlfn.IFNA(VLOOKUP($C23,'Product Information'!$A$2:$C$31,3),\"\")","v":""}]
[{"$f":"IF('Input Calculation'!B18=9224318825,'Input Calculation'!A18,\"\")","v":""},null,{"$f":"IFERROR(VLOOKUP(VALUE($B$20),'Input Calculation'!$A$2:$AJ$29,17),\"\")","v":""},{"$f":"_xlfn.IFNA(VLOOKUP($C24,'Product Information'!$A$2:$C$31,2),\"\")","v":""},{"$f":"_xlfn.IFNA(VLOOKUP($C24,'Product Information'!$A$2:$C$31,3),\"\")","v":""}]
[{"$f":"IF('Input Calculation'!B19=9224318825,'Input Calculation'!A19,\"\")","v":""},null,{"$f":"IFERROR(VLOOKUP(VALUE($B$20),'Input Calculation'!$A$2:$AJ$29,19),\"\")","v":""},{"$f":"_xlfn.IFNA(VLOOKUP($C25,'Product Information'!$A$2:$C$31,2),\"\")","v":""},{"$f":"_xlfn.IFNA(VLOOKUP($C25,'Product Information'!$A$2:$C$31,3),\"\")","v":""}]
[{"$f":"IF('Input Calculation'!B20=9224318825,'Input Calculation'!A20,\"\")","v":1019},null,{"$f":"IFERROR(VLOOKUP(VALUE($B$20),'Input Calculation'!$A$2:$AJ$29,21),\"\")","v":""},{"$f":"_xlfn.IFNA(VLOOKUP($C26,'Product Information'!$A$2:$C$31,2),\"\")","v":""},{"$f":"_xlfn.IFNA(VLOOKUP($C26,'Product Information'!$A$2:$C$31,3),\"\")","v":""}]
[{"$f":"IF('Input Calculation'!B21=9224318825,'Input Calculation'!A21,\"\")","v":""},null,{"$f":"IFERROR(VLOOKUP(VALUE($B$20),'Input Calculation'!$A$2:$AJ$29,23),\"\")","v":""},{"$f":"_xlfn.IFNA(VLOOKUP($C27,'Product Information'!$A$2:$C$31,2),\"\")","v":""},{"$f":"_xlfn.IFNA(VLOOKUP($C27,'Product Information'!$A$2:$C$31,3),\"\")","v":""}]
[{"$f":"IF('Input Calculation'!B22=9224318825,'Input Calculation'!A22,\"\")","v":""},null,{"$f":"IFERROR(VLOOKUP(VALUE($B$20),'Input Calculation'!$A$2:$AJ$29,25),\"\")","v":""},{"$f":"_xlfn.IFNA(VLOOKUP($C28,'Product Information'!$A$2:$C$31,2),\"\")","v":""},{"$f":"_xlfn.IFNA(VLOOKUP($C28,'Product Information'!$A$2:$C$31,3),\"\")","v":""}]
[{"$f":"IF('Input Calculation'!B23=9224318825,'Input Calculation'!A23,\"\")","v":""},null,{"$f":"IFERROR(VLOOKUP(VALUE($B$20),'Input Calculation'!$A$2:$AJ$29,27),\"\")","v":""},{"$f":"_xlfn.IFNA(VLOOKUP($C29,'Product Information'!$A$2:$C$31,2),\"\")","v":""},{"$f":"_xlfn.IFNA(VLOOKUP($C29,'Product Information'!$A$2:$C$31,3),\"\")","v":""}]
[{"$f":"IF('Input Calculation'!B24=9224318825,'Input Calculation'!A24,\"\")","v":""},null,null,"Total:",{"$f":"IFERROR(VLOOKUP(VALUE($B$20),'Input Calculation'!$A$2:$AJ$29,36),\"\")","v":""},"Notes: "]
[{"$f":"IF('Input Calculation'!B25=9224318825,'Input Calculation'!A25,\"\")","v":""}]
[{"$f":"IF('Input Calculation'!B26=9224318825,'Input Calculation'!A26,\"\")","v":""},{"$f":"MID($A$7,LEN(B8)+LEN(B20)+1,4)","v":""},{"$f":"IFERROR(VLOOKUP(VALUE($B$32),'Input Calculation'!$A$2:$AJ$29,9),\"\")","v":""},{"$f":"_xlfn.IFNA(VLOOKUP($C32,'Product Information'!$A$2:$C$31,2),\"\")","v":""},{"$f":"_xlfn.IFNA(VLOOKUP($C32,'Product Information'!$A$2:$C$31,3),\"\")","v":""}]
[{"$f":"IF('Input Calculation'!B27=9224318825,'Input Calculation'!A27,\"\")","v":""},null,{"$f":"IFERROR(VLOOKUP(VALUE($B$32),'Input Calculation'!$A$2:$AJ$29,11),\"\")","v":""},{"$f":"_xlfn.IFNA(VLOOKUP($C33,'Product Information'!$A$2:$C$31,2),\"\")","v":""},{"$f":"_xlfn.IFNA(VLOOKUP($C33,'Product Information'!$A$2:$C$31,3),\"\")","v":""}]
[{"$f":"IF('Input Calculation'!B28=9224318825,'Input Calculation'!A28,\"\")","v":""},null,{"$f":"IFERROR(VLOOKUP(VALUE($B$32),'Input Calculation'!$A$2:$AJ$29,13),\"\")","v":""},{"$f":"_xlfn.IFNA(VLOOKUP($C34,'Product Information'!$A$2:$C$31,2),\"\")","v":""},{"$f":"_xlfn.IFNA(VLOOKUP($C34,'Product Information'!$A$2:$C$31,3),\"\")","v":""}]
[{"$f":"IF('Input Calculation'!B29=9224318825,'Input Calculation'!A29,\"\")","v":""},null,{"$f":"IFERROR(VLOOKUP(VALUE($B$32),'Input Calculation'!$A$2:$AJ$29,15),\"\")","v":""},{"$f":"_xlfn.IFNA(VLOOKUP($C35,'Product Information'!$A$2:$C$31,2),\"\")","v":""},{"$f":"_xlfn.IFNA(VLOOKUP($C35,'Product Information'!$A$2:$C$31,3),\"\")","v":""}]
[{"$f":"IF('Input Calculation'!B30=9224318825,'Input Calculation'!A30,\"\")","v":""},null,{"$f":"IFERROR(VLOOKUP(VALUE($B$32),'Input Calculation'!$A$2:$AJ$29,17),\"\")","v":""},{"$f":"_xlfn.IFNA(VLOOKUP($C36,'Product Information'!$A$2:$C$31,2),\"\")","v":""},{"$f":"_xlfn.IFNA(VLOOKUP($C36,'Product Information'!$A$2:$C$31,3),\"\")","v":""}]
[null,null,{"$f":"IFERROR(VLOOKUP(VALUE($B$32),'Input Calculation'!$A$2:$AJ$29,19),\"\")","v":""},{"$f":"_xlfn.IFNA(VLOOKUP($C37,'Product Information'!$A$2:$C$31,2),\"\")","v":""},{"$f":"_xlfn.IFNA(VLOOKUP($C37,'Product Information'!$A$2:$C$31,3),\"\")","v":""}]
[null,null,{"$f":"IFERROR(VLOOKUP(VALUE($B$32),'Input Calculation'!$A$2:$AJ$29,21),\"\")","v":""},{"$f":"_xlfn.IFNA(VLOOKUP($C38,'Product Information'!$A$2:$C$31,2),\"\")","v":""},{"$f":"_xlfn.IFNA(VLOOKUP($C38,'Product Information'!$A$2:$C$31,3),\"\")","v":""}]
[null,null,{"$f":"IFERROR(VLOOKUP(VALUE($B$32),'Input Calculation'!$A$2:$AJ$29,23),\"\")","v":""},{"$f":"_xlfn.IFNA(VLOOKUP($C39,'Product Information'!$A$2:$C$31,2),\"\")","v":""},{"$f":"_xlfn.IFNA(VLOOKUP($C39,'Product Information'!$A$2:$C$31,3),\"\")","v":""}]
[null,null,{"$f":"IFERROR(VLOOKUP(VALUE($B$32),'Input Calculation'!$A$2:$AJ$29,25),\"\")","v":""},{"$f":"_xlfn.IFNA(VLOOKUP($C40,'Product Information'!$A$2:$C$31,2),\"\")","v":""},{"$f":"_xlfn.IFNA(VLOOKUP($C40,'Product Information'!$A$2:$C$31,3),\"\")","v":""}]
[null,null,{"$f":"IFERROR(VLOOKUP(VALUE($B$32),'Input Calculation'!$A$2:$AJ$29,27),\"\")","v":""},{"$f":"_xlfn.IFNA(VLOOKUP($C41,'Product Information'!$A$2:$C$31,2),\"\")","v":""},{"$f":"_xlfn.IFNA(VLOOKUP($C41,'Product Information'!$A$2:$C$31,3),\"\")","v":""}]
[null,null,null,"Total:",{"$f":"IFERROR(VLOOKUP(VALUE($B$32),'Input Calculation'!$A$2:$AJ$29,36),\"\")","v":""},"Notes: "]
[]
[null,{"$f":"MID($A$7,LEN(B8)+LEN(B20)+LEN(B32)+1,4)","v":""},{"$f":"IFERROR(VLOOKUP(VALUE($B$44),'Input Calculation'!$A$2:$AJ$29,9),\"\")","v":""},{"$f":"_xlfn.IFNA(VLOOKUP($C44,'Product Information'!$A$2:$C$31,2),\"\")","v":""},{"$f":"_xlfn.IFNA(VLOOKUP($C44,'Product Information'!$A$2:$C$31,3),\"\")","v":""}]
[null,null,{"$f":"IFERROR(VLOOKUP(VALUE($B$44),'Input Calculation'!$A$2:$AJ$29,11),\"\")","v":""},{"$f":"_xlfn.IFNA(VLOOKUP($C45,'Product Information'!$A$2:$C$31,2),\"\")","v":""},{"$f":"_xlfn.IFNA(VLOOKUP($C45,'Product Information'!$A$2:$C$31,3),\"\")","v":""}]
[null,null,{"$f":"IFERROR(VLOOKUP(VALUE($B$44),'Input Calculation'!$A$2:$AJ$29,13),\"\")","v":""},{"$f":"_xlfn.IFNA(VLOOKUP($C46,'Product Information'!$A$2:$C$31,2),\"\")","v":""},{"$f":"_xlfn.IFNA(VLOOKUP($C46,'Product Information'!$A$2:$C$31,3),\"\")","v":""}]
[null,null,{"$f":"IFERROR(VLOOKUP(VALUE($B$44),'Input Calculation'!$A$2:$AJ$29,15),\"\")","v":""},{"$f":"_xlfn.IFNA(VLOOKUP($C47,'Product Information'!$A$2:$C$31,2),\"\")","v":""},{"$f":"_xlfn.IFNA(VLOOKUP($C47,'Product Information'!$A$2:$C$31,3),\"\")","v":""}]
[null,null,{"$f":"IFERROR(VLOOKUP(VALUE($B$44),'Input Calculation'!$A$2:$AJ$29,17),\"\")","v":""},{"$f":"_xlfn.IFNA(VLOOKUP($C48,'Product Information'!$A$2:$C$31,2),\"\")","v":""},{"$f":"_xlfn.IFNA(VLOOKUP($C48,'Product Information'!$A$2:$C$31,3),\"\")","v":""}]
[null,null,{"$f":"IFERROR(VLOOKUP(VALUE($B$44),'Input Calculation'!$A$2:$AJ$29,19),\"\")","v":""},{"$f":"_xlfn.IFNA(VLOOKUP($C49,'Product Information'!$A$2:$C$31,2),\"\")","v":""},{"$f":"_xlfn.IFNA(VLOOKUP($C49,'Product Information'!$A$2:$C$31,3),\"\")","v":""}]
[null,null,{"$f":"IFERROR(VLOOKUP(VALUE($B$44),'Input Calculation'!$A$2:$AJ$29,21),\"\")","v":""},{"$f":"_xlfn.IFNA(VLOOKUP($C50,'Product Information'!$A$2:$C$31,2),\"\")","v":""},{"$f":"_xlfn.IFNA(VLOOKUP($C50,'Product Information'!$A$2:$C$31,3),\"\")","v":""}]
[null,null,{"$f":"IFERROR(VLOOKUP(VALUE($B$44),'Input Calculation'!$A$2:$AJ$29,23),\"\")","v":""},{"$f":"_xlfn.IFNA(VLOOKUP($C51,'Product Information'!$A$2:$C$31,2),\"\")","v":""},{"$f":"_xlfn.IFNA(VLOOKUP($C51,'Product Information'!$A$2:$C$31,3),\"\")","v":""}]
[null,null,{"$f":"IFERROR(VLOOKUP(VALUE($B$44),'Input Calculation'!$A$2:$AJ$29,25),\"\")","v":""},{"$f":"_xlfn.IFNA(VLOOKUP($C52,'Product Information'!$A$2:$C$31,2),\"\")","v":""},{"$f":"_xlfn.IFNA(VLOOKUP($C52,'Product Information'!$A$2:$C$31,3),\"\")","v":""}]
[null,null,{"$f":"IFERROR(VLOOKUP(VALUE($B$44),'Input Calculation'!$A$2:$AJ$29,27),\"\")","v":""},{"$f":"_xlfn.IFNA(VLOOKUP($C53,'Product Information'!$A$2:$C$31,2),\"\")","v":""},{"$f":"_xlfn.IFNA(VLOOKUP($C53,'Product Information'!$A$2:$C$31,3),\"\")","v":""}]
[null,null,null,"Total:",{"$f":"IFERROR(VLOOKUP(VALUE($B$44),'Input Calculation'!$A$2:$AJ$29,36),\"\")","v":""},"Notes: "]
[]
[null,{"$f":"MID($A$7,LEN(B8)+LEN(B20)+LEN(B32)+LEN(B44)+1,4)","v":""},{"$f":"IFERROR(VLOOKUP(VALUE($B$56),'Input Calculation'!$A$2:$AJ$29,9),\"\")","v":""},{"$f":"_xlfn.IFNA(VLOOKUP($C56,'Product Information'!$A$2:$C$31,2),\"\")","v":""},{"$f":"_xlfn.IFNA(VLOOKUP($C56,'Product Information'!$A$2:$C$31,3),\"\")","v":""}]
[null,null,{"$f":"IFERROR(VLOOKUP(VALUE($B$56),'Input Calculation'!$A$2:$AJ$29,11),\"\")","v":""},{"$f":"_xlfn.IFNA(VLOOKUP($C57,'Product Information'!$A$2:$C$31,2),\"\")","v":""},{"$f":"_xlfn.IFNA(VLOOKUP($C57,'Product Information'!$A$2:$C$31,3),\"\")","v":""}]
[null,null,{"$f":"IFERROR(VLOOKUP(VALUE($B$56),'Input Calculation'!$A$2:$AJ$29,13),\"\")","v":""},{"$f":"_xlfn.IFNA(VLOOKUP($C58,'Product Information'!$A$2:$C$31,2),\"\")","v":""},{"$f":"_xlfn.IFNA(VLOOKUP($C58,'Product Information'!$A$2:$C$31,3),\"\")","v":""}]
[null,null,{"$f":"IFERROR(VLOOKUP(VALUE($B$56),'Input Calculation'!$A$2:$AJ$29,15),\"\")","v":""},{"$f":"_xlfn.IFNA(VLOOKUP($C59,'Product Information'!$A$2:$C$31,2),\"\")","v":""},{"$f":"_xlfn.IFNA(VLOOKUP($C59,'Product Information'!$A$2:$C$31,3),\"\")","v":""}]
[null,null,{"$f":"IFERROR(VLOOKUP(VALUE($B$56),'Input Calculation'!$A$2:$AJ$29,17),\"\")","v":""},{"$f":"_xlfn.IFNA(VLOOKUP($C60,'Product Information'!$A$2:$C$31,2),\"\")","v":""},{"$f":"_xlfn.IFNA(VLOOKUP($C60,'Product Information'!$A$2:$C$31,3),\"\")","v":""}]
[null,null,{"$f":"IFERROR(VLOOKUP(VALUE($B$56),'Input Calculation'!$A$2:$AJ$29,19),\"\")","v":""},{"$f":"_xlfn.IFNA(VLOOKUP($C61,'Product Information'!$A$2:$C$31,2),\"\")","v":""},{"$f":"_xlfn.IFNA(VLOOKUP($C61,'Product Information'!$A$2:$C$31,3),\"\")","v":""}]
[null,null,{"$f":"IFERROR(VLOOKUP(VALUE($B$56),'Input Calculation'!$A$2:$AJ$29,21),\"\")","v":""},{"$f":"_xlfn.IFNA(VLOOKUP($C62,'Product Information'!$A$2:$C$31,2),\"\")","v":""},{"$f":"_xlfn.IFNA(VLOOKUP($C62,'Product Information'!$A$2:$C$31,3),\"\")","v":""}]
[null,null,{"$f":"IFERROR(VLOOKUP(VALUE($B$56),'Input Calculation'!$A$2:$AJ$29,23),\"\")","v":""},{"$f":"_xlfn.IFNA(VLOOKUP($C63,'Product Information'!$A$2:$C$31,2),\"\")","v":""},{"$f":"_xlfn.IFNA(VLOOKUP($C63,'Product Information'!$A$2:$C$31,3),\"\")","v":""}]
[null,null,{"$f":"IFERROR(VLOOKUP(VALUE($B$56),'Input Calculation'!$A$2:$AJ$29,25),\"\")","v":""},{"$f":"_xlfn.IFNA(VLOOKUP($C64,'Product Information'!$A$2:$C$31,2),\"\")","v":""},{"$f":"_xlfn.IFNA(VLOOKUP($C64,'Product Information'!$A$2:$C$31,3),\"\")","v":""}]
[null,null,{"$f":"IFERROR(VLOOKUP(VALUE($B$56),'Input Calculation'!$A$2:$AJ$29,27),\"\")","v":""},{"$f":"_xlfn.IFNA(VLOOKUP($C65,'Product Information'!$A$2:$C$31,2),\"\")","v":""},{"$f":"_xlfn.IFNA(VLOOKUP($C65,'Product Information'!$A$2:$C$31,3),\"\")","v":""}]
[null,null,null,"Total:",{"$f":"IFERROR(VLOOKUP(VALUE($B$56),'Input Calculation'!$A$2:$AJ$29,36),\"\")","v":""},"Notes: "]
[]
[null,{"$f":"MID($A$7,LEN(B8)+LEN(B20)+LEN(B32)+LEN(B44)+LEN(B56)+1,4)","v":""},{"$f":"IFERROR(VLOOKUP(VALUE($B$68),'Input Calculation'!$A$2:$AJ$29,9),\"\")","v":""},{"$f":"_xlfn.IFNA(VLOOKUP($C68,'Product Information'!$A$2:$C$31,2),\"\")","v":""},{"$f":"_xlfn.IFNA(VLOOKUP($C68,'Product Information'!$A$2:$C$31,3),\"\")","v":""}]
[null,null,{"$f":"IFERROR(VLOOKUP(VALUE($B$68),'Input Calculation'!$A$2:$AJ$29,11),\"\")","v":""},{"$f":"_xlfn.IFNA(VLOOKUP($C69,'Product Information'!$A$2:$C$31,2),\"\")","v":""},{"$f":"_xlfn.IFNA(VLOOKUP($C69,'Product Information'!$A$2:$C$31,3),\"\")","v":""}]
[null,null,{"$f":"IFERROR(VLOOKUP(VALUE($B$68),'Input Calculation'!$A$2:$AJ$29,13),\"\")","v":""},{"$f":"_xlfn.IFNA(VLOOKUP($C70,'Product Information'!$A$2:$C$31,2),\"\")","v":""},{"$f":"_xlfn.IFNA(VLOOKUP($C70,'Product Information'!$A$2:$C$31,3),\"\")","v":""}]
[null,null,{"$f":"IFERROR(VLOOKUP(VALUE($B$68),'Input Calculation'!$A$2:$AJ$29,15),\"\")","v":""},{"$f":"_xlfn.IFNA(VLOOKUP($C71,'Product Information'!$A$2:$C$31,2),\"\")","v":""},{"$f":"_xlfn.IFNA(VLOOKUP($C71,'Product Information'!$A$2:$C$31,3),\"\")","v":""}]
[null,null,{"$f":"IFERROR(VLOOKUP(VALUE($B$68),'Input Calculation'!$A$2:$AJ$29,17),\"\")","v":""},{"$f":"_xlfn.IFNA(VLOOKUP($C72,'Product Information'!$A$2:$C$31,2),\"\")","v":""},{"$f":"_xlfn.IFNA(VLOOKUP($C72,'Product Information'!$A$2:$C$31,3),\"\")","v":""}]
[null,null,{"$f":"IFERROR(VLOOKUP(VALUE($B$68),'Input Calculation'!$A$2:$AJ$29,19),\"\")","v":""},{"$f":"_xlfn.IFNA(VLOOKUP($C73,'Product Information'!$A$2:$C$31,2),\"\")","v":""},{"$f":"_xlfn.IFNA(VLOOKUP($C73,'Product Information'!$A$2:$C$31,3),\"\")","v":""}]
[null,null,{"$f":"IFERROR(VLOOKUP(VALUE($B$68),'Input Calculation'!$A$2:$AJ$29,21),\"\")","v":""},{"$f":"_xlfn.IFNA(VLOOKUP($C74,'Product Information'!$A$2:$C$31,2),\"\")","v":""},{"$f":"_xlfn.IFNA(VLOOKUP($C74,'Product Information'!$A$2:$C$31,3),\"\")","v":""}]
[null,null,{"$f":"IFERROR(VLOOKUP(VALUE($B$68),'Input Calculation'!$A$2:$AJ$29,23),\"\")","v":""},{"$f":"_xlfn.IFNA(VLOOKUP($C75,'Product Information'!$A$2:$C$31,2),\"\")","v":""},{"$f":"_xlfn.IFNA(VLOOKUP($C75,'Product Information'!$A$2:$C$31,3),\"\")","v":""}]
[null,null,{"$f":"IFERROR(VLOOKUP(VALUE($B$68),'Input Calculation'!$A$2:$AJ$29,25),\"\")","v":""},{"$f":"_xlfn.IFNA(VLOOKUP($C76,'Product Information'!$A$2:$C$31,2),\"\")","v":""},{"$f":"_xlfn.IFNA(VLOOKUP($C76,'Product Information'!$A$2:$C$31,3),\"\")","v":""}]
[null,null,{"$f":"IFERROR(VLOOKUP(VALUE($B$68),'Input Calculation'!$A$2:$AJ$29,27),\"\")","v":""},{"$f":"_xlfn.IFNA(VLOOKUP($C77,'Product Information'!$A$2:$C$31,2),\"\")","v":""},{"$f":"_xlfn.IFNA(VLOOKUP($C77,'Product Information'!$A$2:$C$31,3),\"\")","v":""}]
[null,null,null,"Total:",{"$f":"IFERROR(VLOOKUP(VALUE($B$68),'Input Calculation'!$A$2:$AJ$29,36),\"\")","v":""},"Notes: "]